3,5-Octadien-2-one
- Formula: C8H12O
- Molecular weight: 124.1803
- IUPAC Standard InChIKey: LWRKMRFJEUFXIB-UHFFFAOYSA-N
- CAS Registry Number: 38284-27-4
- Chemical structure:
View 3d structure (requires JavaScript / HTML 5) - Species with the same structure:
- Stereoisomers:
- Other names: 3,5-Octadiene-2-one; Octa-3,5-dien-2-one; 3,5-Octadienone

Kovats' RI, non-polar column, temperature ramp

Column type | Active phase | I | Reference | Comment |
---|---|---|---|---|
Capillary | DB-5 | 1052. | Mevy, Bessiere, et al., 2006 | 25. m/0.2 mm/0.15 μm, He, 60. C @ 3. min, 3. K/min; Tend: 220. C |
Capillary | DB-1 | 1063. | Takeoka, Perrino, et al., 1996 | 60. m/0.25 mm/0.25 μm, 30. C @ 4. min, 2. K/min; Tend: 220. C |
Capillary | DB-1 | 1068. | Takeoka, Perrino, et al., 1996 | 60. m/0.25 mm/0.25 μm, 30. C @ 4. min, 2. K/min; Tend: 220. C |
Capillary | SE-30 | 1048. | Greenberg, 1981 | He, 40. C @ 3. min, 3. K/min; Column length: 50. m; Column diameter: 0.5 mm; Tend: 170. C |
Capillary | SE-30 | 1049. | Greenberg, 1981 | He, 40. C @ 3. min, 3. K/min; Column length: 50. m; Column diameter: 0.5 mm; Tend: 170. C |
Capillary | SE-30 | 1070. | Greenberg, 1981 | He, 40. C @ 3. min, 3. K/min; Column length: 50. m; Column diameter: 0.5 mm; Tend: 170. C |
Capillary | SE-30 | 1071. | Greenberg, 1981 | He, 40. C @ 3. min, 3. K/min; Column length: 50. m; Column diameter: 0.5 mm; Tend: 170. C |
Capillary | SE-30 | 1048. | Greenberg, 1981, 2 | He, 70. C @ 2. min, 5. K/min, 170. C @ 5. min; Column length: 50. m; Column diameter: 0.5 mm |
Capillary | SE-30 | 1072. | Greenberg, 1981, 2 | He, 70. C @ 2. min, 5. K/min, 170. C @ 5. min; Column length: 50. m; Column diameter: 0.5 mm |

Van Den Dool and Kratz RI, non-polar column, temperature ramp

Column type | Active phase | I | Reference | Comment |
---|---|---|---|---|
Capillary | DB-5 | 1072. | Methven L., Tsoukka M., et al., 2007 | 60. m/0.32 mm/1. μm, 40. C @ 2. min, 4. K/min, 260. C @ 10. min |
Capillary | HP-5 | 1102. | Xian Q., Chen H., et al., 2006 | 30. m/0.25 mm/0.25 μm, He, 3. K/min, 220. C @ 20. min; Tstart: 50. C |
Capillary | HP-5MS | 1093. | Afsharypuor and Suleimany, 2002 | 30. m/0.25 mm/0.25 μm, He, 4. K/min; Tstart: 60. C; Tend: 275. C |
Capillary | CP Sil 8 CB | 1099. | Elmore, Campo, et al., 2002 | 60. m/0.25 mm/0.25 μm, He, 40. C @ 2. min, 4. K/min; Tend: 280. C |
Capillary | BPX-5 | 1081. | Oruna-Concha, Duckham, et al., 2001 | 50. m/0.32 mm/0.25 μm, He, 35. C @ 3. min, 4. K/min, 250. C @ 10. min |
Capillary | SPB-1 | 1067. | Huang, Bruechert, et al., 1987 | 60. m/0.25 mm/0.25 μm, He, 35. C @ 10. min, 2. K/min, 235. C @ 40. min |

Van Den Dool and Kratz RI, non-polar column, custom temperature program

Column type | Active phase | I | Reference | Comment |
---|---|---|---|---|
Capillary | DB-5MS | 1098. | Varlet V., Knockaert C., et al., 2006 | 30. m/0.32 mm/0.5 μm, He; Program: 70C(1min) => 3C/min => 80C(1min) => 5C/min => 150C => 10C/min => 280C (4min) |
Capillary | HP-5MS | 1081. | Bonaiti, Irlinger, et al., 2005 | 30. m/0.25 mm/0.25 μm, He; Program: 5C(8min) => 3C/min => 20C => 10C/min => 150C(10min) |
Capillary | DB-5MS | 1092. | Turchini, Giani, et al., 2004 | 30. m/0.25 mm/0.25 μm, He; Program: 35C => 120C/min => 60C1.5C/min => 100C => 5C/min => 280C |
Capillary | HP-5 | 1076. | Engel, Baty, et al., 2002 | 30. m/0.25 mm/0.25 μm, He; Program: 5C(5min) => 3C/min => 20C => 5C/min => 100C 15C/min => 150C (5min) |
Capillary | CP-Sil 8CB-MS | 1099. | Elmore, Mottram, et al., 2000 | 60. m/0.25 mm/0.25 μm, He; Program: 0C(5min) => 40C/min => 40C (2min) => 4C/min => 280C |
Capillary | SE-54 | 1107. | Ullrich and Grosch, 1988 | Program: not specified |

Van Den Dool and Kratz RI, polar column, temperature ramp

Column type | Active phase | I | Reference | Comment |
---|---|---|---|---|
Capillary | DB-Wax | 1569. | Pozo-Bayon M.A., Ruiz-Rodriguez A., et al., 2007 | 30. m/0.25 mm/0.5 μm, He, 40. C @ 5. min, 4. K/min, 250. C @ 15. min |
Capillary | DB-Wax | 1567. | Pozo-Bayon M.A., Ruiz-Rodriguez A., et al., 2007 | 30. m/0.25 mm/0.5 μm, He, 40. C @ 5. min, 4. K/min, 250. C @ 15. min |
Capillary | DB-Wax | 1516. | Nielsen, Larsen, et al., 2004 | 30. m/0.25 mm/0.25 μm, He, 45. C @ 10. min, 6. K/min, 240. C @ 30. min |
Capillary | DB-Wax | 1516. | Nielsen, Larsen, et al., 2004, 2 | 30. m/0.25 mm/0.25 μm, He, 45. C @ 10. min, 6. K/min, 240. C @ 30. min |
Capillary | DB-Wax | 1516. | Nielsen, Larsen, et al., 2003 | 30. m/0.25 mm/0.25 μm, He, 40. C @ 10. min, 6. K/min, 240. C @ 30. min |

Van Den Dool and Kratz RI, polar column, custom temperature program

Column type | Active phase | I | Reference | Comment |
---|---|---|---|---|
Capillary | Supelcowax-10 | 1521. | Bianchi, Careri, et al., 2007 | 30. m/0.25 mm/0.25 μm, He; Program: 35C(8min) => 4C/min => 60C => 6C/min => 160C => 20C/min => 200C(1min) |
Capillary | CP-Wax 52CB | 1518. | Verzera, Ziino, et al., 2004 | 60. m/0.25 mm/0.25 μm, He; Program: 45C(5min) => 10C/min => 80C => 2C/min => 240C |

Normal alkane RI, non-polar column, temperature ramp

Column type | Active phase | I | Reference | Comment |
---|---|---|---|---|
Capillary | SPB-5 | 1074. | Sivadier, Ratel, et al., 2009 | 60. m/0.32 mm/1.00 μm, 40. C @ 5. min, 3. K/min, 230. C @ 10. min |
Capillary | MDN-5 | 1098. | Mildner-Szkudlarz, Jelen, et al., 2003 | 30. m/0.25 mm/0.25 μm, He, 40. C @ 1. min, 20. K/min, 280. C @ 1. min |
Capillary | SPB-1 | 1043. | Vichi, Castellote, et al., 2003 | 30. m/0.25 mm/0.25 μm, He, 40. C @ 10. min, 3. K/min; Tend: 200. C |
Capillary | HP-5 | 1096. | Boylston and Viniyard, 1998 | 50. m/0.32 mm/0.52 μm, 35. C @ 15. min, 2. K/min, 250. C @ 45. min |
Capillary | OV-101 | 1056. | Misharina, Golovnya, et al., 1991 | 50. m/0.32 mm/0.5 μm, He, 4. K/min; Tstart: 50. C; Tend: 250. C |
Capillary | DB-1 | 1040. | Habu, Flath, et al., 1985 | 3. K/min; Column length: 50. m; Column diameter: 0.32 mm; Tstart: 0. C; Tend: 250. C |
Capillary | DB-1 | 1040. | Habu, Flath, et al., 1985 | 3. K/min; Column length: 50. m; Column diameter: 0.32 mm; Tstart: 50. C; Tend: 250. C |
Capillary | DB-1 | 1065. | Habu, Flath, et al., 1985 | 3. K/min; Column length: 50. m; Column diameter: 0.32 mm; Tstart: 0. C; Tend: 250. C |
Capillary | DB-1 | 1063. | Habu, Flath, et al., 1985 | 3. K/min; Column length: 50. m; Column diameter: 0.32 mm; Tstart: 50. C; Tend: 250. C |
Capillary | OV-101 | 1048. | del Rosario, de Lumen, et al., 1984 | He, 0. C @ 1. min, 3. K/min; Column length: 50. m; Column diameter: 0.31 mm; Tend: 225. C |
Capillary | OV-101 | 1072. | del Rosario, de Lumen, et al., 1984 | He, 0. C @ 1. min, 3. K/min; Column length: 50. m; Column diameter: 0.31 mm; Tend: 225. C |

Normal alkane RI, non-polar column, custom temperature program

Column type | Active phase | I | Reference | Comment |
---|---|---|---|---|
Capillary | TR-5 MS | 1070. | Kurashov, Mitrukova, et al., 2014 | 15. m/0.25 mm/0.25 μm, Helium; Program: 35 0C (3 min) 2 0C/min -> 60 0C (3 min) 2 0C/min -> 80 0C (3 min) 4 0C/min -> 120 0C (3 min) 5 0C/min -> 150 0C (3 min) 15 0C/min -> 240 0C (10 min) |
Capillary | HP-5 MS | 1098. | Xie, Sun, et al., 2008 | 30. m/0.25 mm/0.25 μm, Helium; Program: 40 0C (2 min) 4 0C/min -> 220 0C 20 0C/min -> 280 0C |
Capillary | HP-5 | 1069. | Dou, Li, et al., 2007 | 30. m/0.32 mm/0.25 μm, He; Program: 40 0C (2 min) 110 0C (2 min) 3 0C/min -> 170 0C (2 min) 4 0C/min -> 220 0C (2 min) 10 0C/min -> 260 0C (5 min) |
Capillary | HP-5MS | 1090. | Mallia, Escher, et al., 2007 | Program: not specified |
Capillary | MDN-5 | 1074. | Turchimi, Mentasti, et al., 2004 | 30. m/0.25 mm/0.25 μm, Helium; Program: 35 0C (1 min) 120 0C/min -> 60 0C 2 0C/min -> 280 0C |

Normal alkane RI, polar column, temperature ramp

Column type | Active phase | I | Reference | Comment |
---|---|---|---|---|
Capillary | FFAP | 1536. | Nebesny, Budryn, et al., 2007 | 30. m/0.32 mm/0.5 μm, N2, 35. C @ 5. min, 4. K/min, 320. C @ 45. min |
Capillary | Supelcowax-10 | 1521. | Vichi, Castellote, et al., 2003 | 30. m/0.25 mm/0.25 μm, He, 40. C @ 10. min, 3. K/min; Tend: 200. C |
Capillary | HP-FFAP | 1505. | Preininger and Ullrich, 2001 | 50. m/0.32 mm/0.5 μm, 6. K/min, 230. C @ 15. min; Tstart: 35. C |
Capillary | Supelcowax-10 | 1531. | Girard and Durance, 2000 | 60. m/0.25 mm/0.25 μm, He, 35. C @ 10. min, 4. K/min; Tend: 200. C |
Capillary | Carbowax 20M | 1536. | Xue, Ye, et al., 2000 | He, 60. C @ 2. min, 5. K/min, 190. C @ 20. min; Column length: 25. m; Column diameter: 0.3 mm |

Normal alkane RI, polar column, custom temperature program

Column type | Active phase | I | Reference | Comment |
---|---|---|---|---|
Capillary | HP-Innowax | 1531. | Cajka, Riddellova, et al., 2010 | 30. m/0.25 mm/0.25 μm, Helium; Program: 45 0C (1 min) 5 oC/min -> 170 0C 10 0C/min -> 260 0C (1 min) |
Capillary | CP-Wax 52 CB | 1524. | Romeo, Verzera, et al., 2009 | 60. m/0.25 mm/0.25 μm, Helium; Program: 45 0C (5 min) 3 0C/min -> 150 0C 10 0C/min -> 240 0C |
Capillary | Innowax FSC | 1520. | Baser, Özek, et al., 2004 | 60. m/0.25 mm/0.25 μm, He; Program: 60C(10min) => 4C/min => 220C(10min) => 1C/min => 240C |
Capillary | HP Innowax FSP | 1522. | Tasdemir, Demirci, et al., 2003 | 60. m/0.25 mm/0.25 μm, He; Program: 60C(10min) => 4C/min => 220C (10min) => 1C/min => 240C |
Capillary | HP Innowax FSP | 1522. | Tasdemir, Demirci, et al., 2003 | 60. m/0.25 mm/0.25 μm, He; Program: 60C(10min) => 4C/min => 220C (10min) => 1C/min => 240C |

References

Mevy, Bessiere, et al., 2006
Mevy, J.-P.; Bessiere, J.-M.; Greff, S.; Zombre, G.; Viano, J.,
Composition of the volatile oil from the leaves of Ximenia americana L.,
Biochem. Syst. Ecol., 2006, 34, 7, 549-553, https://doi.org/10.1016/j.bse.2006.01.007
. [all data]
Takeoka, Perrino, et al., 1996
Takeoka, G.; Perrino, C., Jr.; Buttery, R.,
Volatile constituents of used frying oils,
J. Agric. Food Chem., 1996, 44, 3, 654-660, https://doi.org/10.1021/jf950430m
. [all data]
Greenberg, 1981
Greenberg, M.J.,
Characterization of meat and bone meal flavor volatiles,
J. Agric. Food Chem., 1981, 29, 6, 1276-1280, https://doi.org/10.1021/jf00108a043
. [all data]
Greenberg, 1981, 2
Greenberg, M.J.,
Characterization of poultry byproduct meal flavor volatiles,
J. Agric. Food Chem., 1981, 29, 4, 831-834, https://doi.org/10.1021/jf00106a038
. [all data]
Methven L., Tsoukka M., et al., 2007
Methven L.; Tsoukka M.; Oruna-Concha M.J.; Parker J.K.; Mottram D.S.,
Influence of sulfur amino acids on the volatile and nonvolatile components of cooked salmon (Salmo salar),
J. Agric. Food Chem., 2007, 55, 4, 1427-1436, https://doi.org/10.1021/jf0625611
. [all data]
Xian Q., Chen H., et al., 2006
Xian Q.; Chen H.; Zou H.; Yin D.,
Chemical composition of essential oils of two submerged macrophytes, Ceratophyllum demersum L. and Vallisneria spiralis L.,
Flavour Fragr. J., 2006, 21, 3, 524-526, https://doi.org/10.1002/ffj.1588
. [all data]
Afsharypuor and Suleimany, 2002
Afsharypuor, S.; Suleimany, M.,
Volatile oil constituents of Brassica oleracea var. gongylodes seeds,
J. Essent. Oil Res., 2002, 14, 1, 18-19, https://doi.org/10.1080/10412905.2002.9699748
. [all data]
Elmore, Campo, et al., 2002
Elmore, J.S.; Campo, M.M.; Enser, M.; Mottram, D.S.,
Effect of lipid composition on meat-like model systems containing cysteine, ribose, and polyunsaturated fatty acids,
J. Agric. Food Chem., 2002, 50, 5, 1126-1132, https://doi.org/10.1021/jf0108718
. [all data]
Oruna-Concha, Duckham, et al., 2001
Oruna-Concha, M.J.; Duckham, S.C.; Ames, J.M.,
Comparison of volatile compounds isolated from the skin and flesh of four potato cultivars after baking,
J. Agric. Food Chem., 2001, 49, 5, 2414-2421, https://doi.org/10.1021/jf0012345
. [all data]
Huang, Bruechert, et al., 1987
Huang, T.-C.; Bruechert, L.J.; Hartman, T.G.; Rosen, R.T.; Ho, C.-T.,
Effect of lipids and carbohydrates on thermal generation of volatiles from commercial zein,
J. Agric. Food Chem., 1987, 35, 6, 985-990, https://doi.org/10.1021/jf00078a030
. [all data]
Varlet V., Knockaert C., et al., 2006
Varlet V.; Knockaert C.; Prost C.; Serot T.,
Comparison of odor-active volatile compounds of fresh and smoked salmon,
J. Agric. Food Chem., 2006, 54, 9, 3391-3401, https://doi.org/10.1021/jf053001p
. [all data]
Bonaiti, Irlinger, et al., 2005
Bonaiti, C.; Irlinger, F.; Spinnler, H.E.; Engel, E.,
An iterative sensory procedure to select odor-active associations in complex consortia of microorganisms: application to the construction of a cheese model,
J. Dairy Sci., 2005, 88, 5, 1671-1684, https://doi.org/10.3168/jds.S0022-0302(05)72839-3
. [all data]
Turchini, Giani, et al., 2004
Turchini, G.M.; Giani, I.; Caprino, F.; Moretti, V.M.; Valfrè, F.,
Discrimination of origin of farmed trout by means of biometrical parameters, fillet composition and flavor volatile compounds,
Ital. J. Anim. Sci., 2004, 3, 123-140. [all data]
Engel, Baty, et al., 2002
Engel, E.; Baty, C.; le Corre, D.; Souchon, I.; Martin, N.,
Flavor-active compounds potentially implicated in cooked cauliflower acceptance,
J. Agric. Food Chem., 2002, 50, 22, 6459-6467, https://doi.org/10.1021/jf025579u
. [all data]
Elmore, Mottram, et al., 2000
Elmore, J.S.; Mottram, D.S.; Enser, M.; Wood, J.D.,
The effects of diet and breed on the volatile compounds of cooked lamb,
Meat Sci., 2000, 55, 2, 149-159, https://doi.org/10.1016/S0309-1740(99)00137-0
. [all data]
Ullrich and Grosch, 1988
Ullrich, F.; Grosch, W.,
Identification of the most intense odor compounds formed during autoxidation of methyl linolenate at room temperature,
J. Amer. Oil Chem. Soc., 1988, 65, 8, 1313-1317, https://doi.org/10.1007/BF02542413
. [all data]
Pozo-Bayon M.A., Ruiz-Rodriguez A., et al., 2007
Pozo-Bayon M.A.; Ruiz-Rodriguez A.; Pernin K.; Cayot N.,
Influence of eggs on the aroma composition of a sponge cake and on the aroma release in model studies on flavored sponge cakes,
J. Agric. Food Chem., 2007, 55, 4, 1418-1426, https://doi.org/10.1021/jf062203y
. [all data]
Nielsen, Larsen, et al., 2004
Nielsen, G.S.; Larsen, L.M.; Poll, L.,
Formation of aroma compounds during long-term frozen storage of unblanched leek (Allium ampeloprasum Var. Bulga) as affected by packaging atmosphere and slice thickness,
J. Agric. Food Chem., 2004, 52, 5, 1234-1240, https://doi.org/10.1021/jf0306183
. [all data]
Nielsen, Larsen, et al., 2004, 2
Nielsen, G.S.; Larsen, L.M.; Poll, L.,
Impact of blanching and packaging atmosphere on the formation of aroma compounds during long-term frozen storage of leek (Allium ampeloprasum Var. Bulga) slices,
J. Agric. Food Chem., 2004, 52, 15, 4844-4852, https://doi.org/10.1021/jf049623c
. [all data]
Nielsen, Larsen, et al., 2003
Nielsen, G.S.; Larsen, L.M.; Poll, L.,
Formation of aroma compounds and lipoxygenase (EC 1.13.11.12) activity in unblanced leek (Allium ampeloprasum Var. Bulga) slices during long-term frozen storage,
J. Agric. Food Chem., 2003, 51, 7, 1970-1976, https://doi.org/10.1021/jf020921o
. [all data]
Bianchi, Careri, et al., 2007
Bianchi, F.; Careri, M.; Mangia, A.; Musci, M.,
Retention indices in the analysis of food aroma volatile compounds in temperature-programmed gas chromatography: Database creation and evaluation of precision and robustness,
J. Sep. Sci., 2007, 39, 4, 563-572, https://doi.org/10.1002/jssc.200600393
. [all data]
Verzera, Ziino, et al., 2004
Verzera, A.; Ziino, M.; Condurso, C.; Romeo, V.; Zappala, M.,
Solid-phase microextraction and gas chromatography-mass spectrometry for rapid characterisation of semi-hard cheeses,
Anal. Bioanal. Chem., 2004, 380, 7-8, 930-936, https://doi.org/10.1007/s00216-004-2879-4
. [all data]
Sivadier, Ratel, et al., 2009
Sivadier, G.; Ratel, J.; Engel, E.,
Latency and persistence of diet volatile biomarkers in lamb fats,
J. Agric. Food Chem., 2009, 57, 2, 645-652, https://doi.org/10.1021/jf802467q
. [all data]
Mildner-Szkudlarz, Jelen, et al., 2003
Mildner-Szkudlarz, S.; Jelen, H.H.; Zawirska-Wojtasiak, R.; Wasowicz, E.,
Application of headspace - solid phase microextraction and multivariate analysis for plant oils differentiation,
Food Chem., 2003, 83, 4, 515-522, https://doi.org/10.1016/S0308-8146(03)00147-X
. [all data]
Vichi, Castellote, et al., 2003
Vichi, S.; Castellote, A.I.; Pizzale, L.; Conte, L.S.; Buxaderas, S.; López-Tamames, E.,
Analysis of virgin olive oil volatile compounds by headspace solid-phase microextraction coupled to gas chromatography with mass spectrometric and flame ionization detection,
J. Chromatogr. A, 2003, 983, 1-2, 19-33, https://doi.org/10.1016/S0021-9673(02)01691-6
. [all data]
Boylston and Viniyard, 1998
Boylston, T.D.; Viniyard, B.T.,
Isolation of volatile flavor compounds from peanut butter using purge-and-trap technique
in Instrumental Methods in Food and Beverage Analysis, D. Wetzel and G. Charalambous, ed(s)., 1998, 225-243. [all data]
Misharina, Golovnya, et al., 1991
Misharina, T.A.; Golovnya, R.V.; Charnomskii, V.V.,
Volatile components of boiled shrimp funchalia woodwardi and crab geryon maritae,
Zh. Anal. Khim., 1991, 46, 1421-1429. [all data]
Habu, Flath, et al., 1985
Habu, T.; Flath, R.A.; Mon, T.R.; Morton, J.F.,
Volatile components of Rooibos tea (Aspalathus linearis),
J. Agric. Food Chem., 1985, 33, 2, 249-254, https://doi.org/10.1021/jf00062a024
. [all data]
del Rosario, de Lumen, et al., 1984
del Rosario, R.; de Lumen, B.O.; Habu, T.; Flath, R.A.; Mon, T.R.; Teranishi, R.,
Comparison of headspace volatiles from winged beans and soybeans,
J. Agric. Food Chem., 1984, 32, 5, 1011-1015, https://doi.org/10.1021/jf00125a015
. [all data]
Kurashov, Mitrukova, et al., 2014
Kurashov, E.A.; Mitrukova, G.G.; Krylova, Yu.V.,
Variations in the component composition of essential oil of Ceratophyllum demersum (Ceratophyllaceae) during vegetation (in press),
Plant Resources (Rastitel'nye Resursy), 2014, 1, 000-000. [all data]
Xie, Sun, et al., 2008
Xie, J.; Sun, B.; Zheng, F.; Wang, S.,
Volatile flavor constituents in roasted pork of mini-pig,
Food Chem., 2008, 109, 3, 506-514, https://doi.org/10.1016/j.foodchem.2007.12.074
. [all data]
Dou, Li, et al., 2007
Dou, H.-L.; Li, C.-M.; Gu, H.-F.; Hao, J.-F.,
Comparative analysis on aromatic components of green tea and fresh green tea beverage using HS-SPME/GC-MS/GC-olfactometry/RI methods,
Journal of Tea Science, 2007, 27, 1, 51-60. [all data]
Mallia, Escher, et al., 2007
Mallia, S.; Escher, F.; Rehberger, B.; Schlichtherle-Cerny, H.,
Aroma-active secondary oxidation products of butter, 3rd QLIF Congress, Hohenheim, Germany, March 20-23, 2007, 2007, retrieved from http://orgprints.org/view/projects/intconfqlif2007.html; http://orgprints.org/9734/. [all data]
Turchimi, Mentasti, et al., 2004
Turchimi, G.N.; Mentasti, T.; Carpino, F.; Panseri, S.; Moretti, V.M.; Valfre, F.,
Effects of dietary lipid sources on flavour volatile compounds of brown trout (Salmo trurra L.) fillet,
J. Appl. Ichtyol., 2004, 20, 1, 71-75, https://doi.org/10.1046/j.0175-8659.2003.00522.x
. [all data]
Nebesny, Budryn, et al., 2007
Nebesny, E.; Budryn, G.; Kula, J.; Majda, T.,
The effect of roasting method on headspace composition of robusta coffee bean aroma,
Eur. Food Res. Technol., 2007, 225, 1, 9-19, https://doi.org/10.1007/s00217-006-0375-0
. [all data]
Preininger and Ullrich, 2001
Preininger, M.; Ullrich, F.,
Trace compound analysis for off-flavor characterization of micromilled milk powder,
Am. Chem. Soc. Symp. Ser., 2001, 782, 46-61. [all data]
Girard and Durance, 2000
Girard, B.; Durance, T.,
Headspace volatiles of sockeye and pink salmon as affected by retort process,
Food Chem. Toxicol., 2000, 65, 1, 34-39. [all data]
Xue, Ye, et al., 2000
Xue, C.; Ye, M.; Li, Z.; Cai, Y.; Tan, L.; Lin, H.; Sakaguchi, M.,
Changes in the volatile compounds of Yellowtail (Seriola aureovitata) during refrigerated storage,
Asian Fisheries Sciences, 2000, 13, 263-270. [all data]
Cajka, Riddellova, et al., 2010
Cajka, T.; Riddellova, K.; Klimankova, E.; Carna, M.; Pudil, F.; Hajslova, J.,
Traceability of olive oil based on volatiles pattern and multivariante analysis,
Food Chem., 2010, 121, 1, 282-289, https://doi.org/10.1016/j.foodchem.2009.12.011
. [all data]
Romeo, Verzera, et al., 2009
Romeo, V.; Verzera, A.; Ziino, M.; Condurao, C.; Tripodi, G.,
Headspace volatiles of Vicia sativa L. (Legumnodeae) by solid-phase microextraction and gas chromatography/mass spectrometry,
J. Ess. Oil Res., 2009, 21, 1, 33-35, https://doi.org/10.1080/10412905.2009.9700101
. [all data]
Baser, Özek, et al., 2004
Baser, K.H.C.; Özek, T.; Kirimer, N.; Deliorman, D.; Ergun, F.,
Composition of the essential oils of Galium aparine L. and Galium odoratum (L.) Scop. from Turkey,
J. Essent. Oil Res., 2004, 16, 4, 305-307, https://doi.org/10.1080/10412905.2004.9698728
. [all data]
Tasdemir, Demirci, et al., 2003
Tasdemir, D.; Demirci, B.; Demirci, F.; Dönmez, A.A.; Baser, K.H.C.; Rüedi, P.,
Analysis of the Volatile Components of Five Turkish Rhododendron Species by Headspace Solid-Phase Microextraction and GC-MS (HS-SPME-GC-MS),
Z. Naturforsch., 2003, 58c, 797-803. [all data]