Androst-4-ene-3,11,17-trione
- Formula: C19H24O3
- Molecular weight: 300.3921
- IUPAC Standard InChIKey: RZRPTBIGEANTGU-UHFFFAOYSA-N
- CAS Registry Number: 382-45-6
- Chemical structure:
View 3d structure (requires JavaScript / HTML 5) - Other names: Adrenosterone; Reichstein's substance g; 11-Oxy-4-androstenedione; 4-Androsten-3,11,17-trione

Van Den Dool and Kratz RI, non-polar column, custom temperature program

Column type | Active phase | I | Reference | Comment |
---|---|---|---|---|
Capillary | VF-5MS | 2801.3 | Tret'yakov, 2008 | 30. m/0.25 mm/0.25 μm, He; Program: Multi-step temperature program; T(initial)=60C; T(final)=270C |

References

Tret'yakov, 2008
Tret'yakov, K.V.,
Retention Data. NIST Mass Spectrometry Data Center., NIST Mass Spectrometry Data Center, 2008. [all data]