(E) 1-Methyl-1-cyclooctene
- Formula: C9H16
- Molecular weight: 124.2233
- IUPAC Standard InChIKey: WFLPGXDWMZEHGP-VQHVLOKHSA-N
- CAS Registry Number: 38229-26-4
- Chemical structure:
View 3d structure (requires JavaScript / HTML 5) - Stereoisomers:

Gas phase thermochemistry data

Data compiled by: Hussein Y. Afeefy, Joel F. Liebman, and Stephen E. Stein
Quantity | Value | Units | Method | Reference | Comment |
---|---|---|---|---|---|
ΔfH°gas | -5.4 | kJ/mol | Chyd | Roth, Adamczak, et al., 1991 |

Reaction thermochemistry data

Data compiled by: Hussein Y. Afeefy, Joel F. Liebman, and Stephen E. Stein
Individual Reactions
By formula: H2 + C9H16 = C9H18
Quantity | Value | Units | Method | Reference | Comment |
---|---|---|---|---|---|
ΔrH° | -147. | kJ/mol | Chyd | Roth, Adamczak, et al., 1991 | liquid phase |

References

Roth, Adamczak, et al., 1991
Roth, W.R.; Adamczak, O.; Breuckmann, R.; Lennartz, H.-W.; Boese, R.,
Die Berechnung von Resonanzenergien; das MM2ERW-Kraftfeld,
Chem. Ber., 1991, 124, 2499-2521. [all data]