Pentafluorodimethyl ether
- Formula: C2HF5O
- Molecular weight: 136.0208
- IUPAC Standard InChIKey: ACYQYBAHTSKBLM-UHFFFAOYSA-N
- CAS Registry Number: 3822-68-2
- Chemical structure:
View 3d structure (requires JavaScript / HTML 5) - Permanent link for this species. Use this link for bookmarking this species for future reference.

Phase change data

Data compiled as indicated in comments:
TRC - Thermodynamics Research Center, NIST Boulder Laboratories, Chris Muzny director
AC - William E. Acree, Jr., James S. Chickos
Quantity | Value | Units | Method | Reference | Comment |
---|---|---|---|---|---|
Tboil | 238.6 | K | N/A | Hwang, DesMarteau, et al., 1992 | Uncertainty assigned by TRC = 0.5 K; TRC |
Quantity | Value | Units | Method | Reference | Comment |
Tfus | 116. | K | N/A | Wang, Adcock, et al., 1991 | Uncertainty assigned by TRC = 2. K; TRC |
Quantity | Value | Units | Method | Reference | Comment |
Tc | 353.85 | K | N/A | Wang, Adcock, et al., 1991 | Uncertainty assigned by TRC = 0.3 K; TRC |
Quantity | Value | Units | Method | Reference | Comment |
Pc | 33.26 | bar | N/A | Wang, Adcock, et al., 1991 | Uncertainty assigned by TRC = 0.12 bar; TRC |
Enthalpy of vaporization
ΔvapH (kJ/mol) | Temperature (K) | Method | Reference | Comment |
---|---|---|---|---|
22.3 | 239. | I | Kul, DesMarteau, et al., 2001 | Based on data from 216. to 238. K.; AC |
19.3 | 260. | EB | Weber and Defibaugh, 1996 | Based on data from 229. to 331. K.; AC |
17.6 | 280. | EB | Weber and Defibaugh, 1996 | Based on data from 229. to 331. K.; AC |
15.6 | 300. | EB | Weber and Defibaugh, 1996 | Based on data from 229. to 331. K.; AC |
20.4 | 255. | A | Salvi-Narkhede, Wang, et al., 1992 | Based on data from 240. to 313. K.; AC |

Reaction thermochemistry data

Data compiled as indicated in comments:
B - John E. Bartmess
M - Michael M. Meot-Ner (Mautner) and Sharon G. Lias
Individual Reactions
By formula: CN- + C2HF5O = (CN- • C2HF5O)
Quantity | Value | Units | Method | Reference | Comment |
---|---|---|---|---|---|
ΔrH° | 78. ± 15. | kJ/mol | IMRE | Larson and McMahon, 1987 | gas phase; B,M |
Quantity | Value | Units | Method | Reference | Comment |
ΔrS° | 104. | J/mol*K | N/A | Larson and McMahon, 1987 | gas phase; switching reaction,Thermochemical ladder(CN-)H2O, Entropy change calculated or estimated; Payzant, Yamdagni, et al., 1971; M |
Quantity | Value | Units | Method | Reference | Comment |
ΔrG° | 47.3 ± 9.6 | kJ/mol | IMRE | Larson and McMahon, 1987 | gas phase; B,M |
By formula: Cl- + C2HF5O = (Cl- • C2HF5O)
Quantity | Value | Units | Method | Reference | Comment |
---|---|---|---|---|---|
ΔrH° | 73.2 ± 1.7 | kJ/mol | TDAs | Bogdanov, Lee, et al., 2001 | gas phase; B |
Quantity | Value | Units | Method | Reference | Comment |
ΔrG° | 47.3 ± 4.2 | kJ/mol | TDAs | Bogdanov, Lee, et al., 2001 | gas phase; B |
ΔrG° | 50.6 ± 8.4 | kJ/mol | IMRE | Larson and McMahon, 1984 | gas phase; B,M |
By formula: F- + C2HF5O = (F- • C2HF5O)
Quantity | Value | Units | Method | Reference | Comment |
---|---|---|---|---|---|
ΔrG° | 113. ± 8.4 | kJ/mol | IMRE | Larson and McMahon, 1984 | gas phase; B,M |

Ion clustering data

Data compiled as indicated in comments:
B - John E. Bartmess
M - Michael M. Meot-Ner (Mautner) and Sharon G. Lias
Clustering reactions
By formula: CN- + C2HF5O = (CN- • C2HF5O)
Quantity | Value | Units | Method | Reference | Comment |
---|---|---|---|---|---|
ΔrH° | 78. ± 15. | kJ/mol | IMRE | Larson and McMahon, 1987 | gas phase; B,M |
Quantity | Value | Units | Method | Reference | Comment |
ΔrS° | 104. | J/mol*K | N/A | Larson and McMahon, 1987 | gas phase; switching reaction,Thermochemical ladder(CN-)H2O, Entropy change calculated or estimated; Payzant, Yamdagni, et al., 1971; M |
Quantity | Value | Units | Method | Reference | Comment |
ΔrG° | 47.3 ± 9.6 | kJ/mol | IMRE | Larson and McMahon, 1987 | gas phase; B,M |
By formula: Cl- + C2HF5O = (Cl- • C2HF5O)
Quantity | Value | Units | Method | Reference | Comment |
---|---|---|---|---|---|
ΔrH° | 73.2 ± 1.7 | kJ/mol | TDAs | Bogdanov, Lee, et al., 2001 | gas phase; B |
Quantity | Value | Units | Method | Reference | Comment |
ΔrG° | 47.3 ± 4.2 | kJ/mol | TDAs | Bogdanov, Lee, et al., 2001 | gas phase; B |
ΔrG° | 50.6 ± 8.4 | kJ/mol | IMRE | Larson and McMahon, 1984 | gas phase; B,M |
By formula: F- + C2HF5O = (F- • C2HF5O)
Quantity | Value | Units | Method | Reference | Comment |
---|---|---|---|---|---|
ΔrG° | 113. ± 8.4 | kJ/mol | IMRE | Larson and McMahon, 1984 | gas phase; B,M |

References

Hwang, DesMarteau, et al., 1992
Hwang, S.H.; DesMarteau, D.D.; Beyerlein, A.L.; Smith, N.D.; Joyner, P.,
The heat capacity of fluorinated propane and butane derivatives by differential scanning calorimetry,
J. Therm. Anal., 1992, 38, 2515-28. [all data]
Wang, Adcock, et al., 1991
Wang, B.H.; Adcock, J.L.; Mathur, S.B.; Van Hook, W.A.,
Vapor pressures, liquid molar volumes, vapor non-idealities, and critical properties of some fluorinated ethers: CF3OCF2OCF3, CF3OCF2CF2H, c-CF2CF2 CF2O, CF3OCF2H, and CF3OCH3; and of CCl3F and CF2CI,
J. Chem. Thermodyn., 1991, 23, 699-710. [all data]
Kul, DesMarteau, et al., 2001
Kul, Ismail; DesMarteau, Darryl D.; Beyerlein, Adolph L.,
Vapor--liquid equilibria for CF3OCF2H/fluorinated ethane and CF3SF5/fluorinated ethane mixtures as potential R22 alternatives,
Fluid Phase Equilibria, 2001, 185, 1-2, 241-253, https://doi.org/10.1016/S0378-3812(01)00474-5
. [all data]
Weber and Defibaugh, 1996
Weber, Lloyd A.; Defibaugh, Dana R.,
Vapor Pressure of Pentafluorodimethyl Ether,
J. Chem. Eng. Data, 1996, 41, 3, 382-385, https://doi.org/10.1021/je950217m
. [all data]
Salvi-Narkhede, Wang, et al., 1992
Salvi-Narkhede, M.; Wang, Bao-Huai; Adcock, James L.; Alexander Van Hook, W.,
Vapor pressures, liquid molar volumes, vapor non-ideality, and critical properties of some partially fluorinated ethers (CF3OCF2CF2H, CF3OCF2H, and CF3OCH3), some perfluoroethers (CF3OCF2OCF3, c-CF2OCF2OCF2, and c-CF2CF2CF2O), and of CHF2Br and CF3CFHCF3,
The Journal of Chemical Thermodynamics, 1992, 24, 10, 1065-1075, https://doi.org/10.1016/S0021-9614(05)80017-5
. [all data]
Larson and McMahon, 1987
Larson, J.W.; McMahon, T.B.,
Hydrogen bonding in gas phase anions. The energetics of interaction between cyanide ion and bronsted acids,
J. Am. Chem. Soc., 1987, 109, 6230. [all data]
Payzant, Yamdagni, et al., 1971
Payzant, J.D.; Yamdagni, R.; Kebarle, P.,
Hydration of CN-, NO2-, NO3-, and HO- in the gas phase,
Can. J. Chem., 1971, 49, 3308. [all data]
Bogdanov, Lee, et al., 2001
Bogdanov, B.; Lee, H.J.S.; McMahon, T.B.,
Influence of fluorine substitution on the structures and thermochemistry of chloride ion-ether complexes in the gas phase,
Int. J. Mass Spectrom., 2001, 210, 387-402, https://doi.org/10.1016/S1387-3806(01)00404-3
. [all data]
Larson and McMahon, 1984
Larson, J.W.; McMahon, T.B.,
Fluoride and chloride affinities of main group oxides, fluorides, oxofluorides, and alkyls. Quantitative scales of lewis acidities from ion cyclotron resonance halide-exchange equilibria,
J. Phys. Chem., 1984, 88, 1083. [all data]