Propane, 1,1,1,3,3,3-hexafluoro-2-trifluoromethyl-
- Formula: C4HF9
- Molecular weight: 220.0364
- IUPAC Standard InChIKey: IMRLDNHHTCXOOR-UHFFFAOYSA-N
- CAS Registry Number: 382-24-1
- Chemical structure:
View 3d structure (requires JavaScript / HTML 5) - Other names: Isobutane, perfluoro-; 2-(Trifluoromethyl)-1,1,1,3,3,3-hexafluoropropane

Gas phase ion energetics data

Data compiled by: John E. Bartmess
De-protonation reactions
C4F9- + =
By formula: C4F9- + H+ = C4HF9
Quantity | Value | Units | Method | Reference | Comment |
---|---|---|---|---|---|
ΔrH° | 334.3 ± 2.1 | kcal/mol | G+TS | Koppel, Pihl, et al., 1994 | gas phase |
Quantity | Value | Units | Method | Reference | Comment |
ΔrG° | 326.6 ± 2.0 | kcal/mol | IMRE | Koppel, Pihl, et al., 1994 | gas phase |

Phase change data

Data compiled by: Robert L. Brown and Stephen E. Stein
Quantity | Value | Units | Method | Reference | Comment |
---|---|---|---|---|---|
Tboil | 285. to 287. | K | N/A | PCR Inc., 1990 |

References

Koppel, Pihl, et al., 1994
Koppel, I.A.; Pihl, V.; Koppel, I.A.; Anvia, F.; Taft, R.W.,
Thermodynamic acidity of (CF3)3CH and 1H-undecafluorobicyclo[2.2.1]heptane: The concept of anionic (fluorine) hyperconjugation,
J. Am. Chem. Soc., 1994, 116, 19, 8654, https://doi.org/10.1021/ja00098a027
. [all data]