1,1,3,3,3-Pentafluoro-2-(trifluoromethyl)-1-propene
- Formula: C4F8
- Molecular weight: 200.0300
- IUPAC Standard InChIKey: DAFIBNSJXIGBQB-UHFFFAOYSA-N
- CAS Registry Number: 382-21-8
- Chemical structure:
View 3d structure (requires JavaScript / HTML 5) - Other names: Perfluoroisobutylene; PFIB; 1-Propene, 1,1,3,3,3-pentafluoro-2-(trifluoromethyl)-; Propene, pentafluoro-2-(trifluoromethyl)-; Octafluoroisobutene; Octafluoroisobutylene; Perfluorisobutylene; Perfluoroisobutene; Propene, 1,1,3,3,3-pentafluoro-2-(trifluoromethyl)-; Isobutene, octafluoro-; Octafluoro-sec-butene; 1,1,3,3,3-Pentafluoro-2-(trifluoromethyl)propene; 1,1-Difluoro-2,2-bis(trifluoromethyl)ethene; Perfluoro-2-(trifluoromethyl)propene; Perfluoro-2-methylpropene

Reaction thermochemistry data

Data compiled by: Hussein Y. Afeefy, Joel F. Liebman, and Stephen E. Stein
Individual Reactions
By formula: C4F8 + Cl2 = C4Cl2F8
Quantity | Value | Units | Method | Reference | Comment |
---|---|---|---|---|---|
ΔrH° | -42.22 ± 0.51 | kcal/mol | Cm | Lacher, Kianpour, et al., 1957 | gas phase |

References

Lacher, Kianpour, et al., 1957
Lacher, J.R.; Kianpour, A.; Park, J.D.,
Reaction heats of organic halogen compounds. VIII. The heats of chlorination of perfluorinated butene-1 pentene-1 and isobutene,
J. Phys. Chem., 1957, 61, 584-586. [all data]