Dibenzo[b,e][1,4]dioxin, 1,6-dichloro-
- Formula: C12H6Cl2O2
- Molecular weight: 253.081
- IUPAC Standard InChIKey: MAWMBEVNJGEDAD-UHFFFAOYSA-N
- CAS Registry Number: 38178-38-0
- Chemical structure:
View 3d structure (requires JavaScript / HTML 5) - Other names: 1,6-Dichlorodibenzo[b,e] [1,4]dioxin

Phase change data

Data compiled by: William E. Acree, Jr., James S. Chickos
Enthalpy of sublimation
ΔsubH (kJ/mol) | Temperature (K) | Method | Reference | Comment |
---|---|---|---|---|
113.6 ± 2.3 | 365. | ME | Li, Shibata, et al., 2004 | Based on data from 348. to 383. K. |

References

Li, Shibata, et al., 2004
Li, Xian-Wei; Shibata, Etsuro; Kasai, Eiki; Nakamura, Takashi,
VAPOR PRESSURES AND ENTHALPIES OF SUBLIMATION OF 17 POLYCHLORINATED DIBENZO-p-DIOXINS AND FIVE POLYCHLORINATED DIBENZOFURANS,
Environ Toxicol Chem, 2004, 23, 2, 348-808, https://doi.org/10.1897/03-193
. [all data]