Methylbenzylglyoxal
- Formula: C10H10O2
- Molecular weight: 162.1852
- IUPAC Standard InChIKey: WZLKRAJHCPNZAA-UHFFFAOYSA-N
- CAS Registry Number: 38087-02-4
- Chemical structure:
View 3d structure (requires JavaScript / HTML 5) - Species with the same structure:

Condensed phase thermochemistry data

Data compiled by: Hussein Y. Afeefy, Joel F. Liebman, and Stephen E. Stein
Quantity | Value | Units | Method | Reference | Comment |
---|---|---|---|---|---|
ΔfH°liquid | -310. | kJ/mol | Ccb | Moureu, 1930 | |
Quantity | Value | Units | Method | Reference | Comment |
ΔcH°liquid | -5084. | kJ/mol | Ccb | Moureu, 1930 | Corresponding ΔfHºliquid = -280. kJ/mol (simple calculation by NIST; no Washburn corrections) |

References

Moureu, 1930
Moureu, M.H.,
Des sur la tautomerie des dicetones α,
Ann. Chem., 1930, 14, 283-405. [all data]