2-(1-cyclohexenyl)cyclohexanone
- Formula: C12H18O
- Molecular weight: 178.2707
- IUPAC Standard InChIKey: GVNVAWHJIKLAGL-UHFFFAOYSA-N
- CAS Registry Number: 38055-02-6
- Chemical structure:
View 3d structure (requires JavaScript / HTML 5) - Species with the same structure:

Phase change data

Data compiled by: Thermodynamics Research Center, NIST Boulder Laboratories, Chris Muzny director
Quantity | Value | Units | Method | Reference | Comment |
---|---|---|---|---|---|
Ttriple | 280.8 | K | N/A | Kozyro, Simirsky, et al., 1990 | Uncertainty assigned by TRC = 0.5 K |

References

Kozyro, Simirsky, et al., 1990
Kozyro, A.A.; Simirsky, V.V.; Marachuk, L.I.; Kabo, G.Ya.; Yursha, I.,
Thermodynamic properties of some products of condensation of cyclohexanone
in Vses. Konf. Term. Org. Soedin. 6th, Minsk, p 44, 1990. [all data]