Pentanoic acid, 2-ethyl-2-methyl-, methyl ester
- Formula: C9H18O2
- Molecular weight: 158.2380
- IUPAC Standard InChIKey: JVBYMEHKMMCQBG-UHFFFAOYSA-N
- CAS Registry Number: 37974-23-5
- Chemical structure:
View 3d structure (requires JavaScript / HTML 5) - Other names: Methyl α-ethyl-α-methylvalerate

Kovats' RI, non-polar column, isothermal

Column type | Active phase | Temperature (C) | I | Reference | Comment |
---|---|---|---|---|---|
Packed | Squalane | 120. | 948. | Schomburg, 1964 |

References

Schomburg, 1964
Schomburg, G.,
Gas-Chromatographische Retentionsdaten und Struktur Chemischer Verbindungen. I. Verzweigte Aliphatische und Alicyclische Carbonsäure-Methylester,
J. Chromatogr., 1964, 14, 157-177, https://doi.org/10.1016/S0021-9673(00)86608-X
. [all data]