Ethanethioic acid, S-(1-hydroxy-1-methylethyl) ester
- Formula: C5H10O2S
- Molecular weight: 134.197
- IUPAC Standard InChIKey: NMSBMSLXIQNADU-UHFFFAOYSA-N
- CAS Registry Number: 37960-77-3
- Chemical structure:
View 3d structure (requires JavaScript / HTML 5) - Permanent link for this species. Use this link for bookmarking this species for future reference.

Reaction thermochemistry data

Data compiled by: Hussein Y. Afeefy, Joel F. Liebman, and Stephen E. Stein
Individual Reactions
By formula: C2H4OS + C3H6O = C5H10O2S
Quantity | Value | Units | Method | Reference | Comment |
---|---|---|---|---|---|
ΔrH° | -27. ± 0.8 | kJ/mol | Eqk | Horii, Kawamura, et al., 1972 | liquid phase; solvent: CD3COCD3; NMR |

References

Horii, Kawamura, et al., 1972
Horii, T.; Kawamura, S.; Tsurugi, J.,
A NMR study of the thioacetic acid-acetone mixture,
Bull. Chem. Soc. Jpn., 1972, 45, 2200-2202. [all data]