2,6-Dihydroxybenzoic acid, 3TMS derivative
- Formula: C16H30O4Si3
- Molecular weight: 370.6635
- IUPAC Standard InChIKey: APVNJYLNHAHELF-UHFFFAOYSA-N
- CAS Registry Number: 3782-85-2
- Chemical structure:
View 3d structure (requires JavaScript / HTML 5) - Other names: Benzoic acid, 2,6-bis[(trimethylsilyl)oxy]-, trimethylsilyl ester; 2,6-Dihydroxybenzoic acid, bis(trimethylsilyl) ether, trimethylsilyl ester; Benzoic acid, 2,6-dihydroxy, tri-TMS; Trimethylsilyl 2,6-bis[(trimethylsilyl)oxy]benzoate; Benzoic acid, 2,6-dihydroxy, TMS

Van Den Dool and Kratz RI, non-polar column, temperature ramp

Column type | Active phase | I | Reference | Comment |
---|---|---|---|---|
Packed | OV-1 | 1768. | Butts, 1972 | He, Chromosorb W HP (80-100 mesh), 10. K/min; Column length: 2. m; Tstart: 100. C; Tend: 325. C |

Van Den Dool and Kratz RI, non-polar column, custom temperature program

Column type | Active phase | I | Reference | Comment |
---|---|---|---|---|
Capillary | VF-5MS | 1747.6 | Tret'yakov, 2008 | 30. m/0.25 mm/0.25 μm, He; Program: Multi-step temperature program; T(initial)=60C; T(final)=270C |

Normal alkane RI, non-polar column, custom temperature program

Column type | Active phase | I | Reference | Comment |
---|---|---|---|---|
Capillary | OV-1, SE-30, Methyl silicone, SP-2100, OV-101, DB-1, etc. | 1768. | Waggott and Davies, 1984 | Hydrogen; Column length: 50. m; Column diameter: 0.32 mm; Program: not specified |

References

Butts, 1972
Butts, W.C.,
Two-Column Gas Chromatography of Trimethylsilyl Derivatives of Biochemically Significant Compounds,
Anal. Biochemistry, 1972, 46, 1, 187-199, https://doi.org/10.1016/0003-2697(72)90411-3
. [all data]
Tret'yakov, 2008
Tret'yakov, K.V.,
Retention Data. NIST Mass Spectrometry Data Center., NIST Mass Spectrometry Data Center, 2008. [all data]
Waggott and Davies, 1984
Waggott, A.; Davies, I.W.,
Identification of organic pollutants using linear temperature programmed retention indices (LTPRIs) - Part II, 1984, retrieved from http://dwi.defra.gov.uk/research/completed-research/reports/dwi0383.pdf. [all data]