C9H7BrO2
- Formula: C9H7BrO2
- Molecular weight: 227.055
- CAS Registry Number: 37794-29-9

Gas phase ion energetics data

Data compiled by: John E. Bartmess
De-protonation reactions
C9H6BrO2- + = C9H7BrO2
By formula: C9H6BrO2- + H+ = C9H7BrO2
Quantity | Value | Units | Method | Reference | Comment |
---|---|---|---|---|---|
ΔrH° | 336.4 ± 2.2 | kcal/mol | G+TS | Taft, 1987 | gas phase; value altered from reference due to change in acidity scale |
Quantity | Value | Units | Method | Reference | Comment |
ΔrG° | 329.4 ± 2.0 | kcal/mol | IMRE | Taft, 1987 | gas phase; value altered from reference due to change in acidity scale |

Reaction thermochemistry data

Data compiled by: John E. Bartmess

Individual Reactions

C9H6BrO2- + Hydrogen cation = C9H7BrO2

By formula: C9H6BrO2- + H+ = C9H7BrO2

Quantity Value Units Method Reference Comment
Δr1407. ± 9.2kJ/molG+TSTaft, 1987gas phase; value altered from reference due to change in acidity scale
Quantity Value Units Method Reference Comment
Δr1378. ± 8.4kJ/molIMRETaft, 1987gas phase; value altered from reference due to change in acidity scale

References

Taft, 1987
Taft, R.W.,
The Nature and Analysis of Substitutent Electronic Effects,
Personal communication. See also Prog. Phys. Org. Chem., 1987, 16, 1. [all data]