Furan, 2-pentyl-

Normal alkane RI, non-polar column, custom temperature program

Data compiled by: NIST Mass Spectrometry Data Center, William E. Wallace, director

Column type CapillaryCapillaryCapillaryCapillaryCapillary
Active phase TR-5 MSTR-5 MSDB-1SLB-5 MSSLB-5 MS
Column length (m) 15.15.30.30.30.
Carrier gas HeliumHeliumHydrogenHeliumHelium
Substrate
Column diameter (mm) 0.250.250.250.250.25
Phase thickness (μm) 0.250.250.250.250.25
Program 35 0C (3 min) 2 0C/min -> 60 0C (3 min) 2 0C/min -> 80 0C (3 min) 4 0C/min -> 120 0C (3 min) 5 0C/min -> 150 0C (3 min) 15 0C/min -> 240 0C (10 min)35 0C (3 min) 2 0C/min -> 60 0C (3 min) 2 0C/min -> 80 0C (3 min) 4 0C/min -> 120 0C (3 min) 5 0C/min -> 150 0C (3 mion) 15 0C/min -> 240 0C (10 min)45 0C 3 0C/min -> 175 0C 15 0C/min -> 300 0C (10 min)not specifiednot specified
I 990.1005.973.991.992.
ReferenceKurashov, Mitrukova, et al., 2014Kurashov, Krylova, et al., 2013Albano, Lima, et al., 2012Mondello, 2012Mondello, 2012
Comment MSDC-RI MSDC-RI MSDC-RI MSDC-RI MSDC-RI
Column type CapillaryCapillaryCapillaryCapillaryCapillary
Active phase Polydimethyl siloxane with 5 % Ph groupsPolydimethyl siloxane with 5 % Ph groupsVF-5VF-5Siloxane, 5 % Ph
Column length (m)   30.30.
Carrier gas   HeliumHelium
Substrate
Column diameter (mm)   0.250.25
Phase thickness (μm)   0.250.25
Program not specifiednot specified50 0C (2 min) 3 0C/min -> 200 0C (3 min) 10 0C/min -> 220 0C (8 min)not specifiednot specified
I 993.993.996.991.981.
ReferenceRobinson, Adams, et al., 2012Robinson, Adams, et al., 2012Shivashankar, Roy, et al., 2012Shivashankar, Roy, et al., 2012VOC BinBase, 2012
Comment MSDC-RI MSDC-RI MSDC-RI MSDC-RI MSDC-RI
Column type CapillaryCapillaryCapillaryCapillaryCapillary
Active phase HP-5Polydimethyl siloxane, 5 % phenylRTX-1HP-5DB-1-MS
Column length (m) 30. 60.30.60.
Carrier gas Helium HeliumHeliumHelium
Substrate
Column diameter (mm) 0.32 0.220.320.25
Phase thickness (μm) 0.25 0.250.250.25
Program not specifiednot specifiednot specifiednot specifiednot specified
I 993.981.978.993.977.
ReferenceKahriman, Tosun, et al., 2011Skogerson, Wohlgemuth, et al., 2011Dib, Djabou, et al., 2010Kahriman, Tosun, et al., 2010Takeoka, Hobbs, et al., 2010
Comment MSDC-RI MSDC-RI MSDC-RI MSDC-RI MSDC-RI
Column type CapillaryCapillaryCapillaryCapillaryCapillary
Active phase DB-1Optima-5MSHP-5 MSRTX-5 MSRTX-5 MS
Column length (m) 30.30.30.30.30.
Carrier gas HeliumHeliumHeliumHeliumHelium
Substrate
Column diameter (mm) 0.250.320.250.250.25
Phase thickness (μm) 0.250.250.250.250.25
Program not specified40 0C (5 min) 5 0C/min -> 230 0C 30 0C/min -> 280 0C (5 min)40 0C (5 min) 2 0C/min -> 270 0C -> 260 0C (20 min)50 0C (5 min) 2 0C/min -> 100 0C (5 min) 5 0C/min -> 300 0Cnot specified
I 993.988.1002.989.993.
ReferenceXu, Tang, et al., 2010HEuskin, Godin, et al., 2009Mancini, Arnold, et al., 2009Mebazaa, Mahmoudi, et al., 2009Mebazaa, Mahmoudi, et al., 2009
Comment MSDC-RI MSDC-RI MSDC-RI MSDC-RI MSDC-RI
Column type CapillaryCapillaryCapillaryCapillaryCapillary
Active phase DB-1DB-1HP-5HP-5OV-1
Column length (m) 30.30.50.60.30.
Carrier gas HydrogenHydrogenHeliumHeliumHelium
Substrate
Column diameter (mm) 0.250.250.320.250.25
Phase thickness (μm) 0.250.251.050.25
Program 45 0C 3 0C/min -> 175 0C 15 0C/min -> 300 0C (10 min)45 0C 3 0C/min -> 175 0C 15 0C/min -> 300 0C (10 min)not specified30 0C (2 min) 2 0Cmin -> 60 0C 10 0C/min -> 100 0C 20 0C/min -> 140 0C 10 0C/min -> 200 0C (10 min)40 0C 2 0C/min -> 130 0C (5 min) 10 0C/min -> 230 0C (15 min)
I 973.973.991.993.970.
ReferenceMendes, Trindade, et al., 2009Mendes, Trindade, et al., 2009, 2Pugliese, Sirtori, et al., 2009Rotsatschakul, Visesanguan, et al., 2009Yu, Li, et al., 2009
Comment MSDC-RI MSDC-RI MSDC-RI MSDC-RI MSDC-RI
Column type CapillaryCapillaryCapillaryCapillaryCapillary
Active phase SLB-5 MSSLB-5 MSDB-5DB-1SLB-5MS
Column length (m) 30.30.50.30.10.
Carrier gas HeliumHeliumHeliumHeHelium
Substrate
Column diameter (mm) 0.250.250.320.250.18
Phase thickness (μm) 0.250.250.250.250.18
Program 50 0C 3 0C/min -> 250 0C (1 min) 10 0C/min -> 300 0C (5 min)not specified60 0C (2 min) 5 0C/min -> 160 0C (1 min) 10 0C/min -> 250 0C (3 min)45C => 3C/min => 175C => 15C/min => 300C (10min)not specified
I 991.984.988.972.991.
ReferenceCosta, De Fina, et al., 2008Costa, De Fina, et al., 2008Judzentiene and Budiene, 2008Nogueira, Marcelo-Curto, et al., 2008Risticevic, Carasek, et al., 2008
Comment MSDC-RI MSDC-RI MSDC-RI MSDC-RI MSDC-RI
Column type CapillaryCapillaryCapillaryCapillaryCapillary
Active phase HP-5HP-5 MSHP-5 MSHP-1DB-1
Column length (m) 50.30.30.50.60.
Carrier gas HeliumHeliumHeliumHeN2
Substrate
Column diameter (mm) 0.320.250.250.20.25
Phase thickness (μm) 1.050.250.250.330.25
Program 40 0C (10 min) 5 0C/min -> 200 0C 15 0C/min -> 250 0C (10 min)40 0C (2 min) 4 0C/min -> 220 0C 20 0C/min -> 280 0C40 0C (2 min) 4 0C/min -> 220 0C 20 0C/min -> 280 0C40C(2min) => 2C/min => 200C => 15C/min => 250C (30min)40C(1min) => 5C/min => 150C => 10C/min => 200C(9min)
I 994.993.994.979.980.
ReferenceVentanas, Estevez, et al., 2008Xie, Sun, et al., 2008Xie, Sun, et al., 2008Barra, Baldovini, et al., 2007Lin, Peng, et al., 2007
Comment MSDC-RI MSDC-RI MSDC-RI MSDC-RI MSDC-RI
Column type CapillaryCapillaryCapillaryCapillaryCapillary
Active phase DB-5 MSDB-5HP-5HP-5 MS5 % Phenyl methyl siloxane
Column length (m) 60.50.30.30.30.
Carrier gas HeliumHeliumHeliumHelium
Substrate
Column diameter (mm) 0.320.320.250.250.25
Phase thickness (μm) 1.00.250.250.250.75
Program 40 0C (2 min) 6 0C/min -> 100 0C 4 0C/min -> 180 0C 8 0C/min -> 250 0C (12 min)60 0C (1 min) 5 0C/min -> 160 0C 10 0C/min -> 250 0Cnot specifiednot specified50C(1min) => 5C/min => 100C => 10C/min => 190C => 30C/min => 250C(1min)
I 994.990.981.1003.992.
ReferenceLiu, Xu, et al., 2007Nivinsliene, Butkiene, et al., 2007Ristic, Krivokuca-Dokic, et al., 2007Sharififar, Mozaffarian, et al., 2007Beaulieu J.C. and Lea J.M., 2006
Comment MSDC-RI MSDC-RI MSDC-RI MSDC-RI MSDC-RI
Column type CapillaryCapillaryCapillaryCapillaryCapillary
Active phase HP-5 MSDB-1BP-5BP-5Polydimethyl siloxane with 5 % Ph groups
Column length (m) 30.60.25.25.
Carrier gas  HeHeliumHelium
Substrate
Column diameter (mm) 0.250.320.320.32
Phase thickness (μm) 0.250.250.500.50
Program 40 0C (3 min) 2 0C/min -> 150 0C 20 0C/min -> 220 0C (5 min)33C(5min) => 2C/min => 50c => 5C/min => 225C60 0C 6 0C/min -> 210 0C 10 0C/min -> 290 0C (10 min)not specifiednot specified
I 972.973.999.993.991.
ReferencePyun and Shin, 2006Cramer, Mattinson, et al., 2005Eyres, Dufour, et al., 2005Eyres, Dufour, et al., 2005Pino, Marbot, et al., 2005
Comment MSDC-RI MSDC-RI MSDC-RI MSDC-RI MSDC-RI
Column type CapillaryCapillaryCapillaryCapillaryCapillary
Active phase HP-5MSHP-5DB-5MDN-5MDN-5
Column length (m) 30.50.50.30.30.
Carrier gas He  HeliumHelium
Substrate
Column diameter (mm) 0.250.320.320.250.25
Phase thickness (μm) 0.251.051.050.250.25
Program 60C => 10C/min => 160C => 12C/min => 300C (5min)40C(10min) => 5C/min => 200C => 20C/min => 250C(5min)40C(10min) => 5C/min => 200C => 20C/min => 250C (5min)30 0C (1 min) ballistically -> 60 0C 2 0C/min -> 120 0C 5 0C/min -> 280 0C (5 min)35 0C (1 min) 120 0C/min -> 60 0C 2 0C/min -> 280 0C
I 978.995.995.988.996.
ReferenceDeng, Li, et al., 2004Garcia-Estaban, Ansorena, et al., 2004Garcia-Estaban, Ansorena, et al., 2004, 2Moretti, Madonia, et al., 2004Turchimi, Mentasti, et al., 2004
Comment MSDC-RI MSDC-RI MSDC-RI MSDC-RI MSDC-RI
Column type CapillaryCapillaryCapillaryCapillaryCapillary
Active phase SE-30RTX-5 MSBPX-5HP-5Methyl phenyl siloxane (not specified)
Column length (m)  60.60.30.
Carrier gas  HeHe
Substrate
Column diameter (mm)  0.250.320.25
Phase thickness (μm)  0.51.0.25
Program not specified35C (3min) => 10C/min => 50C => 4C/min => 200C => 50C/min => 250C (10min)40C (4min) => 2C/min => 90C => 4C/min => 130C => 8C/min => 250 C (10min)40C (6min) => 2.5C/min => 150C => 90C/min => 250Cnot specified
I 983.996.991.1001.994.
ReferenceVinogradov, 2004Machiels and Istasse, 2003Machiels, van Ruth, et al., 2003Jordán, Margaría, et al., 2002Poligne, Collignan, et al., 2002
Comment MSDC-RI MSDC-RI MSDC-RI MSDC-RI MSDC-RI
Column type CapillaryCapillaryCapillaryCapillaryCapillary
Active phase DB-5HP-5MSCP Sil 8 CBDB-5 MSBPX-5
Column length (m) 30.30.60.30.30.
Carrier gas  He HeliumHe
Substrate
Column diameter (mm) 0.200.250.250.250.25
Phase thickness (μm) 1.00.250.251.00.25
Program not specified40C (10min) => 3C/min => 120C => 10C/min => 250C (5min)not specifiednot specified50C(2min) => 10C/min => 110C => 5.7C/min => 200C => 40C/min => 250C(5min)
I 997.992.998.1001.999.
ReferenceRapior, Breheret, et al., 2002Ansorena, Gimeno, et al., 2001Duckham, Dodson, et al., 2001Luo and Agnew, 2001Sides, Robards, et al., 2001
Comment MSDC-RI MSDC-RI MSDC-RI MSDC-RI MSDC-RI
Column type CapillaryCapillaryCapillaryCapillaryCapillary
Active phase BPX-5Methyl SiliconeMethyl SiliconeSE-54DB-1
Column length (m) 50.  50.
Carrier gas Helium  He
Substrate
Column diameter (mm) 0.32  0.32
Phase thickness (μm) 0.50
Program 40 0C (5 min) 20 0C/min -> 60 0C (5 min) 4 0C/min -> 250 0C (10 min)not specifiednot specified35 0C (5 min) 8 0C/min -> 200 0C 2 0C/min -> 250 0Cnot specified
I 995.980.980.995.983.
ReferenceMadruga, Arruda, et al., 2000Misharina, 1995Misharina, 1995Um, Bailey, et al., 1992MacLeod and Snyder, 1988
Comment MSDC-RI MSDC-RI MSDC-RI MSDC-RI MSDC-RI
Column type CapillaryCapillary
Active phase DB-1DB-1
Column length (m) 30.30.
Carrier gas H2H2
Substrate
Column diameter (mm) 0.250.25
Phase thickness (μm) 0.250.25
Program 30C (2min) => 2C/min => 150C => 4C/min => 250C30C (2min) => 2C/min => 150C => 4C/min => 250C
I 975.977.
ReferenceTakeoka, Flath, et al., 1988Takeoka, Flath, et al., 1988
Comment MSDC-RI MSDC-RI

Kovats' RI, non-polar column, temperature ramp

Data compiled by: NIST Mass Spectrometry Data Center, William E. Wallace, director

Column type CapillaryCapillaryCapillaryCapillaryCapillary
Active phase HP-5MSDB-1DB-1SE-54SE-30
Column length (m) 30.60.60.30.50.
Carrier gas He  HeHe
Substrate
Column diameter (mm) 0.250.250.250.250.5
Phase thickness (μm) 0.250.250.250.25
Tstart (C) 60.30.30.0.40.
Tend (C) 280.220.220.250.170.
Heat rate (K/min) 3.2.2.12.3.
Initial hold (min)  4.4.12.3.
Final hold (min)
I 996.977.984.989.981.
ReferenceRoussis, Tsoukatou, et al., 2000Takeoka, Perrino, et al., 1996Takeoka, Perrino, et al., 1996Rembold, Wallner, et al., 1989Greenberg, 1981
Comment MSDC-RI MSDC-RI MSDC-RI MSDC-RI MSDC-RI
Column type CapillaryCapillaryCapillary
Active phase SE-30SE-30SE-30
Column length (m) 50.50.50.
Carrier gas HeHeHe
Substrate
Column diameter (mm) 0.50.50.5
Phase thickness (μm)
Tstart (C) 40.70.70.
Tend (C) 170.170.170.
Heat rate (K/min) 3.5.5.
Initial hold (min) 3.2.2.
Final hold (min)  5.5.
I 982.982.984.
ReferenceGreenberg, 1981Greenberg, 1981, 2Greenberg, 1981, 2
Comment MSDC-RI MSDC-RI MSDC-RI

References

Kurashov, Mitrukova, et al., 2014
Kurashov, E.A.; Mitrukova, G.G.; Krylova, Yu.V., Variations in the component composition of essential oil of Ceratophyllum demersum (Ceratophyllaceae) during vegetation (in press), Plant Resources (Rastitel'nye Resursy), 2014, 1, 000-000. [all data]

Kurashov, Krylova, et al., 2013
Kurashov, E.A.; Krylova, Yu.V.; Mitrukova, G.G., Variations in component composition of essential oil of Potamogeton pusillus (Potamogetonaceae) dirong vegetation, Plant Resources (Rastitel'nye Resursy), 2013, 000-000. [all data]

Albano, Lima, et al., 2012
Albano, S.M.; Lima, A.S.; Miguel, M.G.; Pedro, L.G.; Barroso, J.G.; Figueiredo, A.C., Antioxidant, anti-5-lipoxygenase and antiacetylcholinesterase activities of essential oils and decoction water of some aromatic plants, Rec. Nat. Prod., 2012, 6, 1, 35-48. [all data]

Mondello, 2012
Mondello, L., HS-SPME-GCxGC-MS analysis of Yerba Mate (Ilex paraguariensis) in Shimadzu GC-GC application compendium of comprehensive 2D GC, Vol. 1-5, Shimadzu Corp., 2012, 1-29. [all data]

Robinson, Adams, et al., 2012
Robinson, A.L.; Adams, D.O.; Boss, P.K.; Heymann, H.; Solomon, P.S.; Trengove, R.D., Influence of geographic origine on the sensory characteristics and wine composition of Vitus viniferas cv. Cabernet Sauvignon wines from Australia (Supplemental data), Am. J. Enol. Vitic., 2012, 64, 4, 467-476, https://doi.org/10.5344/ajev.2012.12023 . [all data]

Shivashankar, Roy, et al., 2012
Shivashankar, S.; Roy, T.K.; Moorthy, P.N.R., Headspace solid phase micro extraction and GC/MS analysis of the volatile components in seed and cake of Azadirachta indica A. juss, Chem. Bull. of Politechnika Univ. Timisoara, Romania, 2012, 57(71), 1, 1-6. [all data]

VOC BinBase, 2012
VOC BinBase, The volatile compound BinBase (VOC BinBase), 2012, retrieved from http://fiehnlab.ucdavis.edu/projects/VocBinBase and http://binbase.sourceforge.net. [all data]

Kahriman, Tosun, et al., 2011
Kahriman, N.; Tosun, G.; Terzioglu, S.; Karaoglu, S.A.; Yayh, N., Chemical composition and antimicrobial activity of the essential oils from the flower, leaf, and stem of Senecio pandurifolis, Rec. Nat. Prod., 2011, 5, 2, 82-91. [all data]

Skogerson, Wohlgemuth, et al., 2011
Skogerson, K.; Wohlgemuth, G.; Fiehn, O., VocBinNase, 2011, retrieved from http://fiehnlab.ucdavis.edu/projects//VocBinBase. [all data]

Dib, Djabou, et al., 2010
Dib, M.ElA.; Djabou, N.; Desjobert, L.-M.; Allali, H.; Tabti, B.; Muselli, A.; Costa, J., Characterization of volatile compounds of Daucus crinitus Desf. headspace solid phase microextraction as alternative technique to hydrodistillation, Chem, Centr. J., 2010, 4, 16, 1-15. [all data]

Kahriman, Tosun, et al., 2010
Kahriman, N.; Tosun, G.; Genc, H.; Yayli, N., Comparative essential oil analysis of Geranium sylvaticum estracted by hydrodistillation and microwave distillation, Turk. J. Chem., 2010, 34, 969-976. [all data]

Takeoka, Hobbs, et al., 2010
Takeoka, G.R.; Hobbs, C.; Byeoung-Soo, P., Volatile constituents of the aerial parts of Salvia apiana Jepson, J. Essential Oil. Res., 2010, 22, 3, 241-244, https://doi.org/10.1080/10412905.2010.9700314 . [all data]

Xu, Tang, et al., 2010
Xu, X.; Tang, Z.; Liang, Y., Comparative analysis of plant essential oils by GC-MS coupled with integrated chemometric resolution methods, Anal. Methods, 2010, 2, 4, 359-367, https://doi.org/10.1039/b9ay00213h . [all data]

HEuskin, Godin, et al., 2009
HEuskin, S.; Godin, B.; Leroy, P.; Quentin C.; Wathelet, J.-P.; Verheggen, F.; Haubruge, E.; Lognay, G., Fast gas chromatography characterization of purified semiochemicals from essential oils of Matricaria chamomilla L. (Asteraceae) and Nepeta cataria L. (Lamiaceae), J. Chromatorg. A., 2009, 1216, 14, 2768-2775, https://doi.org/10.1016/j.chroma.2008.09.109 . [all data]

Mancini, Arnold, et al., 2009
Mancini, E.; Arnold, N.A.; De Martino, L.; De Feo, V.; Formisano, C.; Rigano, D.; Senatore, F., Chemical composition and phytotoxic effects of essential oils of Salvia hierosolymitana Boiss. and Salvia multicaulis Vahl. var. simplicifolia Boiss. growing wild in Lebanon, Molecules, 2009, 14, 11, 4725-4736, https://doi.org/10.3390/molecules14114725 . [all data]

Mebazaa, Mahmoudi, et al., 2009
Mebazaa, R.; Mahmoudi, A.; Fouchet, M.; Dos Santos, M.; Kamissoko, F.; Nafti, A.; Ben Cheikh, R.; Rega, B.; Camel, V., Characterization of volatile compounds in Tunisian fenugreek seeds, Food Chem., 2009, 115, 4, 1326-1336, https://doi.org/10.1016/j.foodchem.2009.01.066 . [all data]

Mendes, Trindade, et al., 2009
Mendes, M.D.; Trindade, H.; Figueiredo, A.C.; Pedro, L.G.; Barroso, J.G., Chaerophyllum azoricun Trel. grown in the Azores archipelago, Portugal: evaluation of the genetic diversity using molecular markers and comparison with volatile oils profiles, Flavour Fragr. J., 2009, 24, 5, 259-265, https://doi.org/10.1002/ffj.1939 . [all data]

Mendes, Trindade, et al., 2009, 2
Mendes, M.D.; Trindade, H.; Figueiredo, A.C.; Barroso, J.G.; Fontinha, S.S.; Pedro, L.G., Volatile and molecular characterization of two Portuguese endemic species: Angelica lignescens and Melanoselinium decipiens, Biochen. Systematics Ecol., 2009, 37, 2, 98-105, https://doi.org/10.1016/j.bse.2008.12.006 . [all data]

Pugliese, Sirtori, et al., 2009
Pugliese, C.; Sirtori, F.; Ruiz, J.; Martin, D.; Parenti, S.; Franci, O., Effect of pasture on chestnut or acorn on fatty acid composition and aromatic profile of fat of China Senece dry-cured ham, Gracas y Aceites, 2009, 60, 3, 271-276, https://doi.org/10.3989/gya.130208 . [all data]

Rotsatschakul, Visesanguan, et al., 2009
Rotsatschakul, P.; Visesanguan, W.; Smitinont, T.; Chaiseri, S., Changes in volatile compounds during fermentation of nham (Thai fermented sausage), Int. Food Res. J., 2009, 16, 391-414. [all data]

Yu, Li, et al., 2009
Yu, L.-F.; Li, X.-R.; Liu, S.-Y.; Xu, G.-W.; Liang, Y.-Z., Comparative analysis of essential components between the herbal pair Radix Saposhnikoviae-Rhizoma seu Radix Notopterygii and its single herbs by GC-MS combined with a chemometric resolution method, Anal. Methods, 2009, 1, 1, 45-51, https://doi.org/10.1039/b9ay00044e . [all data]

Costa, De Fina, et al., 2008
Costa, R.; De Fina, M.R.; Valentino, M.R.; Rustaiyan, A.; Dugo, P.; Dugo, G.; Mondello, L., An investigation on the volatile composition of some Artemisia species from Iran, Flavour Fragr. J., 2008, 24, 2, 75-82, https://doi.org/10.1002/ffj.1919 . [all data]

Judzentiene and Budiene, 2008
Judzentiene, A.; Budiene, J., Volatile constituents from aerial parts and roots of Cichorium intybis L. (chicory) grown in Lithuania, Chemija, 2008, 19, 2, 25-28. [all data]

Nogueira, Marcelo-Curto, et al., 2008
Nogueira, T.; Marcelo-Curto, M.J.; Cristina Figueiredo, A.; Barroso, J.G.; Pedro, L.G.; Rubiolo, P.; Bicchi, C., Chemotaxonomy of Hypericum genus from Portugal: Geographical distribution and essential oils composition of Hypericum perfoliatum, Hypericum humifusum, Hypericum linarifolium and Hypericum pulchrum, Biochem. Syst. Ecol., 2008, 36, 1, 40-50, https://doi.org/10.1016/j.bse.2007.07.004 . [all data]

Risticevic, Carasek, et al., 2008
Risticevic, S.; Carasek, E.; Pawliszyn, J., Headspace solid-phase microextraction-gas chromatographic-time-of-flight mass spectrometric methodology for geographical origin verification of coffee, Anal. Chim. Acta, 2008, 617, 1-2, 72-84, https://doi.org/10.1016/j.aca.2008.04.009 . [all data]

Ventanas, Estevez, et al., 2008
Ventanas, S.; Estevez, M.; Andres, A.I.; Ruiz, J., Analysis of volatile compounds of Iberian dry-cured loins with different intramuscular fat contents using SPME-DED, Meat Sci., 2008, 79, 1, 172-180, https://doi.org/10.1016/j.meatsci.2007.08.011 . [all data]

Xie, Sun, et al., 2008
Xie, J.; Sun, B.; Zheng, F.; Wang, S., Volatile flavor constituents in roasted pork of mini-pig, Food Chem., 2008, 109, 3, 506-514, https://doi.org/10.1016/j.foodchem.2007.12.074 . [all data]

Barra, Baldovini, et al., 2007
Barra, A.; Baldovini, N.; Loiseau, A.-M.; Albino, L.; Lesecq, C.; Cuvelier, L.L., Chemical analysis of French beans (Phaseolus vulgaris L.) by headspace solid phase microextraction (HS-SPME) and simultaneous distillation/extraction (SDE), Food Chem., 2007, 101, 3, 1279-1284, https://doi.org/10.1016/j.foodchem.2005.12.027 . [all data]

Lin, Peng, et al., 2007
Lin, L.-Y.; Peng, C.-H.; Wang, H.-E.; Wu, T.-H.; Chen, C.-C.; Yu, T.-H.; Wu, C.-M.; Peng, R.Y., Factors affecting solid phase microextraction (SPME) to concentrate the odorants of Chinese white salted noodles for GC-MS analysis, Flavour Fragr. J., 2007, 22, 4, 274-279, https://doi.org/10.1002/ffj.1792 . [all data]

Liu, Xu, et al., 2007
Liu, Y.; Xu, X.-L.; Zhou, G.-H., Comparative study of volatile compounds in traditional Chinese Nanjing marinated duck by different extraction techniques, Int. J. Food Sci. Technol., 2007, 42, 5, 543-550, https://doi.org/10.1111/j.1365-2621.2006.01264.x . [all data]

Nivinsliene, Butkiene, et al., 2007
Nivinsliene, O.; Butkiene, R.; Gudalevic, A.; Mockute, D.; Meskauskiene, V.; Grigaliunaite, B., Influence of urban environment on chemical composition of Tilia cordata essential oil, Chemija, 2007, 18, 1, 44-49. [all data]

Ristic, Krivokuca-Dokic, et al., 2007
Ristic, M.; Krivokuca-Dokic, D.; Radanovic, D.; Nastovski, T., Etarsko ulje Arnica montata i Arnica chamissonis, Hem. Ind., 2007, 61, 5, 272-277, https://doi.org/10.2298/HEMIND0704272R . [all data]

Sharififar, Mozaffarian, et al., 2007
Sharififar, F.; Mozaffarian, V.; Moradkhani, S., Comparison of antioxidant and free radical scavenging activities of the essential oils from flowers and fruits of Otostegia persica Boiss., Pakistan J. Biol. Sci., 2007, 10, 21, 3895-3899, https://doi.org/10.3923/pjbs.2007.3895.3899 . [all data]

Beaulieu J.C. and Lea J.M., 2006
Beaulieu J.C.; Lea J.M., Characterization and semiquantitative analysis of volatiles in seedless watermelon varieties using solid-phase microextraction, J. Agric. Food Chem., 2006, 54, 20, 7789-7793, https://doi.org/10.1021/jf060663l . [all data]

Pyun and Shin, 2006
Pyun, M.-S.; Shin, S., Antifungal effects of the volatile oils from Allium plants against Trichophyton species and synergism of the oils with ketoconazole, Phytomedicine, 2006, 13, 6, 394-400, https://doi.org/10.1016/j.phymed.2005.03.011 . [all data]

Cramer, Mattinson, et al., 2005
Cramer, A.-C.J.; Mattinson, D.S.; Fellman, J.K.; Baik, B.-K., Analysis of volatile compounds from various types of barley cultivars, J. Agric. Food Chem., 2005, 53, 19, 7526-7531, https://doi.org/10.1021/jf0506939 . [all data]

Eyres, Dufour, et al., 2005
Eyres, G.; Dufour, J.-P.; Hallifax, G.; Sotheeswaran, S.; Marriott, P.J., Identification of character-impact odorants in coriander and wild coriander leaves using gas chromatography-olfactometry (GCO) and comprehensive two-dimensional gas chromatography-time-of-flight mass spectrometry (GC×GC-TOFMS), J. Sep. Sci., 2005, 28, 9-10, 1061-1074, https://doi.org/10.1002/jssc.200500012 . [all data]

Pino, Marbot, et al., 2005
Pino, J.A.; Marbot, R.; Rosado, A.; Vázquez, C., Volatile constituents of Malay rose apple [Syzygium malaccense (L.) Merr. Perry], Flavour Fragr. J., 2005, 20, 98-100. [all data]

Deng, Li, et al., 2004
Deng, C.; Li, N.; Zhang, X., Rapid determination of essential oil in Acorus tatarinowii Schott. by pressurized hot water extraction followed by solid-phase microextraction and gas chromatography-mass spectrometry, J. Chromatogr. A, 2004, 1059, 1-2, 149-155, https://doi.org/10.1016/j.chroma.2004.10.005 . [all data]

Garcia-Estaban, Ansorena, et al., 2004
Garcia-Estaban, M.; Ansorena, D.; Astiasaran, I.; Martin, D.; Ruiz, J., Comparison of simultaneous distillation extraction (SDE) and solid-phase microextraction (SPME) for the analysis of volatile compounds in dry-cured ham, J. Sci. Food Agric., 2004, 84, 11, 1364-1370, https://doi.org/10.1002/jsfa.1826 . [all data]

Garcia-Estaban, Ansorena, et al., 2004, 2
Garcia-Estaban, M.; Ansorena, D.; Astiasarán, I.; Ruiz, J., Study of the effect of different fiber coatings and extraction conditions on dry cured ham volatile compounds extracted by solid-phase microextraction (SPME), Talanta, 2004, 64, 2, 458-466, https://doi.org/10.1016/j.talanta.2004.03.007 . [all data]

Moretti, Madonia, et al., 2004
Moretti, V.M.; Madonia, G.; Diaferia, C.; Mentasti, T.; Paleari, M.A.; Panseri, S.; Pirone, G.; Gandini, G., Chemical and microniological parameters and sensory attributes of a typical Sicilian salami ripened in different conditions, Meat Sci., 2004, 66, 4, 845-854, https://doi.org/10.1016/j.meatsci.2003.08.006 . [all data]

Turchimi, Mentasti, et al., 2004
Turchimi, G.N.; Mentasti, T.; Carpino, F.; Panseri, S.; Moretti, V.M.; Valfre, F., Effects of dietary lipid sources on flavour volatile compounds of brown trout (Salmo trurra L.) fillet, J. Appl. Ichtyol., 2004, 20, 1, 71-75, https://doi.org/10.1046/j.0175-8659.2003.00522.x . [all data]

Vinogradov, 2004
Vinogradov, B.A., Production, composition, properties and application of essential oils, 2004, retrieved from http://viness.narod.ru. [all data]

Machiels and Istasse, 2003
Machiels, D.; Istasse, L., Evaluation of two commercial solid-phase microextraction fibres for the analysis of target aroma compounds in cooked beef meat, Talanta, 2003, 61, 4, 529-537, https://doi.org/10.1016/S0039-9140(03)00319-9 . [all data]

Machiels, van Ruth, et al., 2003
Machiels, D.; van Ruth, S.M.; Posthumus, M.A.; Istasse, L., Gas chromatography-olfactometry analysis of the volatile compounds of two commercial Irish beef meats, Talanta, 2003, 60, 4, 755-764, https://doi.org/10.1016/S0039-9140(03)00133-4 . [all data]

Jordán, Margaría, et al., 2002
Jordán, M.J.; Margaría, C.A.; Shaw, P.E.; Goodner, K.L., Aroma active components in aqueous kiwi fruit essence and kiwi fruit puree by GC-MS and multidimensional GC/GC-O, J. Agric. Food Chem., 2002, 50, 19, 5386-5390, https://doi.org/10.1021/jf020297f . [all data]

Poligne, Collignan, et al., 2002
Poligne, I.; Collignan, A.; Trystram, G., Effects of salting, drying, cooking, and smoking operations on volatile compound formation and collor patterns in pork, Food Eng. Physical Properties, 2002, 67, 8, 2976-2986. [all data]

Rapior, Breheret, et al., 2002
Rapior, S.; Breheret, S.; Talou T.; Pelissier, Y.; Bessiere, J.-M., The anise-like odor of Clitocybe odora, Lentinellus cochleatus and Agaricus essettei, Mycologia, 2002, 94, 3, 373-376, https://doi.org/10.2307/3761770 . [all data]

Ansorena, Gimeno, et al., 2001
Ansorena, D.; Gimeno, O.; Astiasarán, I.; Bello, J., Analysis of volatile compounds by GC-MS of a dry fermented sausage: chorizo de Pamplona, Food Res. Int., 2001, 34, 1, 67-75, https://doi.org/10.1016/S0963-9969(00)00133-2 . [all data]

Duckham, Dodson, et al., 2001
Duckham, S.C.; Dodson, A.T.; Bakker, J.; Ames, J.M., Volatile flavour components of baked potato flesh. A comparison of eleven potato cultivars, Nahrung/Food, 2001, 45, 5, 317-323, https://doi.org/10.1002/1521-3803(20011001)45:5<317::AID-FOOD317>3.0.CO;2-4 . [all data]

Luo and Agnew, 2001
Luo, J.; Agnew, M.P., Gas characteristics before and after biofiltration treating odorous emissions from animal rendering processes, Environ. Technol., 2001, 22, 9, 1091-1103, https://doi.org/10.1080/09593332208618220 . [all data]

Sides, Robards, et al., 2001
Sides, A.; Robards, K.; Helliwell, S.; An, M., Changes in the volatile profile of oats induced by processing, J. Agric. Food Chem., 2001, 49, 5, 2125-2130, https://doi.org/10.1021/jf0010127 . [all data]

Madruga, Arruda, et al., 2000
Madruga, M.S.; Arruda, S.G.B.; Narain, N.; Souza, J.G., Castration and slaughter age effects on panel assessment and aroma compounds of the mestico goat meat, Meat Sci., 2000, 56, 2, 117-125, https://doi.org/10.1016/S0309-1740(00)00025-5 . [all data]

Misharina, 1995
Misharina, T.A., Sorption regularities of sulfur- and oxygen-containing compounds in chromatography and their application in identification of volatile organic compounds, Diss. degree of Dr. Sci. (Chemistry), 1995, 52. [all data]

Um, Bailey, et al., 1992
Um, K.W.; Bailey, M.E.; Clarke, A.D.; Chao, R.R., Concentration and identification of volatile compounds from heated beef fat using supercritical CO2 extraction-gas liquid chromatography/mass spectrometry, J. Agric. Food Chem., 1992, 40, 9, 1641-1646, https://doi.org/10.1021/jf00021a033 . [all data]

MacLeod and Snyder, 1988
MacLeod, A.J.; Snyder, C.H., Volatile components of mango preserved by deep freezing, J. Agric. Food Chem., 1988, 36, 1, 137-139, https://doi.org/10.1021/jf00079a035 . [all data]

Takeoka, Flath, et al., 1988
Takeoka, G.R.; Flath, R.A.; Güntert, M.; Jennings, W., Nectarine volatiles: vacuum steam distillation versus headspace sampling, J. Agric. Food Chem., 1988, 36, 3, 553-560, https://doi.org/10.1021/jf00081a037 . [all data]