2-Butenoic acid, 4-bromo-, ethyl ester, (E)-
- Formula: C6H9BrO2
- Molecular weight: 193.038
- IUPAC Standard InChIKey: FHGRPBSDPBRTLS-ONEGZZNKSA-N
- CAS Registry Number: 37746-78-4
- Chemical structure:
View 3d structure (requires JavaScript / HTML 5) - Stereoisomers:
- Other names: Ethyl (E)-4-bromo-2-butenoate; Ethyl γ-bromocrotonate; Ethyl 4-bromocrotonate

Phase change data

Data compiled by: Robert L. Brown and Stephen E. Stein
Reduced pressure boiling point
Tboil (K) | Pressure (bar) | Reference |
---|---|---|
367.7 | 0.016 | Aldrich Chemical Company Inc., 1990 |
376. to 377. | 0.020 | Frinton Laboratories Inc., 1986 |

References

Aldrich Chemical Company Inc., 1990
Aldrich Chemical Company Inc.,
Catalog Handbook of Fine Chemicals, Aldrich Chemical Company, Inc., Milwaukee WI, 1990, 1. [all data]
Frinton Laboratories Inc., 1986
Frinton Laboratories Inc.,
Catalog Number 11, Frinton Laboratories Inc., Vineland, NJ, 1986, 99. [all data]