1H-Indole-2-carboxylic acid, ethyl ester
- Formula: C11H11NO2
- Molecular weight: 189.2105
- IUPAC Standard InChIKey: QQXQAEWRSVZPJM-UHFFFAOYSA-N
- CAS Registry Number: 3770-50-1
- Chemical structure:
View 3d structure (requires JavaScript / HTML 5) - Other names: Indole-2-carboxylic acid, ethyl ester; Ethyl indole-2-carboxylate; Ethyl 1H-indole-2-carboxylate; 2-Carbethoxyindole

Van Den Dool and Kratz RI, non-polar column, temperature ramp

Column type | Active phase | I | Reference | Comment |
---|---|---|---|---|
Capillary | VF-5MS | 1720. | Todua, 2011 | 30. m/0.25 mm/0.25 μm, He; Tstart: 60. C; Tend: 270. C |

References

Todua, 2011
Todua, N.G.,
Retention Data. NIST Mass Spectrometry Data Center., NIST Mass Spectrometry Data Center, 2011. [all data]