4-Methylcarbazole
- Formula: C13H11N
- Molecular weight: 181.2331
- IUPAC Standard InChIKey: GNPUIRFDBYALRI-UHFFFAOYSA-N
- CAS Registry Number: 3770-48-7
- Chemical structure:
View 3d structure (requires JavaScript / HTML 5) - Other names: Carbazole, 4-methyl

Lee's RI, non-polar column, temperature ramp

Column type | Active phase | I | Reference | Comment |
---|---|---|---|---|
Capillary | SE-52 | 331.88 | Vassilaros, Kong, et al., 1982 | 20. m/0.30 mm/0.25 μm, H2, 40. C @ 2. min, 4. K/min; Tend: 265. C |

References

Vassilaros, Kong, et al., 1982
Vassilaros, D.L.; Kong, R.C.; Later, D.W.; Lee, M.L.,
Linear retention index system for polycyclic aromatic compounds. Critical evaluation and additional indices,
J. Chromatogr., 1982, 252, 1-20, https://doi.org/10.1016/S0021-9673(01)88394-1
. [all data]