Cytidine, N-acetyl-
- Formula: C11H15N3O6
- Molecular weight: 285.2533
- IUPAC Standard InChIKey: NIDVTARKFBZMOT-UHFFFAOYSA-N
- CAS Registry Number: 3768-18-1
- Chemical structure:
View 3d structure (requires JavaScript / HTML 5) - Other names: Acetamide, N-(1,2-dihydro-2-oxo-1-β-D-ribofuranosyl-4-pyrimidinyl)-; Acetylcytidine; N-Acetylcytidine; N-4-Acetylcytidine; 4-Acetylcytidine; 4-acetyl-1-(beta-D-ribofuranosyl)cytosine

Reaction thermochemistry data

Data compiled by: Hussein Y. Afeefy, Joel F. Liebman, and Stephen E. Stein
Individual Reactions
By formula: C4H6O3 + C9H13N3O5 = C11H15N3O6 + C2H4O2
Quantity | Value | Units | Method | Reference | Comment |
---|---|---|---|---|---|
ΔrH° | -43.9 | kJ/mol | Kin | Shatynski and Hanesian, 1993 | solid phase |

References

Shatynski and Hanesian, 1993
Shatynski, J.J.; Hanesian, D.,
Adiabatic kinetic studies of the cytidine/acetic anhydride reaction by utilizing temperature versus time data,
Ind. Eng. Chem. Res., 1993, 32, 594-599. [all data]