3,3',4-Trichloro-1,1'-biphenyl
- Formula: C12H7Cl3
- Molecular weight: 257.543
- IUPAC Standard InChIKey: JHBVPKZLIBDTJR-UHFFFAOYSA-N
- CAS Registry Number: 37680-69-6
- Chemical structure:
View 3d structure (requires JavaScript / HTML 5) - Other names: 1,1'-Biphenyl, 3,3',4-trichloro; 3,3',4-Trichlorobiphenyl; PCB 35

Van Den Dool and Kratz RI, non-polar column, temperature ramp

Column type | Active phase | I | Reference | Comment |
---|---|---|---|---|
Capillary | Methyl Silicone | 1932. | Kozloski, 1985 | He, 5. K/min; Column length: 10. m; Column diameter: 0.21 mm; Tstart: 60. C; Tend: 210. C |

Normal alkane RI, non-polar column, temperature ramp

Column type | Active phase | I | Reference | Comment |
---|---|---|---|---|
Capillary | HP-5 | 1967. | Zenkevich, Moeder, et al., 2004 | 30. m/0.25 mm/0.25 μm, Helium, 50. C @ 3. min, 3. K/min, 280. C @ 20. min |
Capillary | SPB-1 | 1915. | Nakano, Tsuji, et al., 1987 | 30. m/0.25 mm/0.25 μm, 4. K/min; Tstart: 130. C; Tend: 280. C |

References

Kozloski, 1985
Kozloski, R.P.,
Polychlorinated biphenyl retention time standards obtained by chemical dechlorination of polychlorinated biphenyl isomers,
J. Chromatogr., 1985, 318, 211-219, https://doi.org/10.1016/S0021-9673(01)90682-X
. [all data]
Zenkevich, Moeder, et al., 2004
Zenkevich, I.G.; Moeder, M.; Koeller, G.; Schrader, S.,
Using new structurally related additive schemes in the precalculation of gas chromatographic retention indices of polychlorinated hydroxybiphenyls on HP-5 stationary phase,
J. Chromatogr. A, 2004, 1025, 2, 227-236, https://doi.org/10.1016/j.chroma.2003.10.106
. [all data]
Nakano, Tsuji, et al., 1987
Nakano, T.; Tsuji, M.; Okuno, T.,
Analytical methods for PCB using GC/ECD and GC/MS with capillary column,
Report of the Environmental Science Institute of Hyoho Prefecture, 1987, 19, 57-62. [all data]