3-Cyclohexene-1-carboxaldehyde, 4-(4-methyl-3-pentenyl)-
- Formula: C13H20O
- Molecular weight: 192.2973
- IUPAC Standard InChIKey: MQBIZQLCHSZBOI-UHFFFAOYSA-N
- CAS Registry Number: 37677-14-8
- Chemical structure:
View 3d structure (requires JavaScript / HTML 5) - Other names: Myrac aldehyde 2; 4-(4-Methyl-3-pentenyl)-3-cyclohexene-1-carbaldehyde; 3-Cyclohexene-1-carboxaldehyde, 4-(4-methyl-3-penten-1-yl)-; 4-(4-Methyl-3-pentenyl)cyclohex-3-ene-1-carbaldehyde; 1-Formyl-4-isohexenyl-4-cyclohexene; p-Myrac aldehyde; Myrac aldehyde; Emfetal

Kovats' RI, non-polar column, isothermal

Column type | Active phase | Temperature (C) | I | Reference | Comment |
---|---|---|---|---|---|
Capillary | SE-30 | 100. | 1497.3 | Tudor, 1997 | 40. m/0.35 mm/0.35 μm |

Normal alkane RI, non-polar column, temperature ramp

Column type | Active phase | I | Reference | Comment |
---|---|---|---|---|
Capillary | OV-101 | 1509. | Egolf and Jurs, 1993 | 2. K/min; Column length: 50. m; Column diameter: 0.22 mm; Tstart: 80. C; Tend: 200. C |

Normal alkane RI, polar column, temperature ramp

Column type | Active phase | I | Reference | Comment |
---|---|---|---|---|
Capillary | Carbowax 20M | 1978. | Egolf and Jurs, 1993 | 2. K/min; Column length: 80. m; Column diameter: 0.2 mm; Tstart: 70. C; Tend: 170. C |

References

Tudor, 1997
Tudor, E.,
Temperature dependence of the retention index for perfumery compounds on a SE-30 glass capillary column. I. Linear equations,
J. Chromatogr. A, 1997, 779, 1-2, 287-297, https://doi.org/10.1016/S0021-9673(97)00453-6
. [all data]
Egolf and Jurs, 1993
Egolf, L.M.; Jurs, P.C.,
Quantitative structure-retention and structure-odor intensity relationships for a diverse group of odor-active compounds,
Anal. Chem., 1993, 65, 21, 3119-3126, https://doi.org/10.1021/ac00069a027
. [all data]