Dibutyl benzylphosphonate
- Formula: C15H25O3P
- Molecular weight: 284.3310
- IUPAC Standard InChIKey: ARIYRPOBFJRCEU-UHFFFAOYSA-N
- CAS Registry Number: 3762-27-4
- Chemical structure:
View 3d structure (requires JavaScript / HTML 5) - Other names: Phosphonic acid, benzyl-, dibutyl ester; Benzylphosphonic acid dibutyl ester; Di-n-butyl benzylphosphonate; Dibutoxyphosphorylmethylbenzene

Phase change data

Data compiled by: Robert L. Brown and Stephen E. Stein
Reduced pressure boiling point
Tboil (K) | Pressure (bar) | Reference |
---|---|---|
413. to 416. | 0.005 | Buckingham and Donaghy, 1982 |

Van Den Dool and Kratz RI, non-polar column, temperature ramp

Column type | Active phase | I | Reference | Comment |
---|---|---|---|---|
Capillary | VF-5MS | 1985. | N/A | 30. m/0.25 mm/0.25 μm, He; Tstart: 60. C; Tend: 270. C |

References

Buckingham and Donaghy, 1982
Buckingham, J.; Donaghy, S.M.,
Dictionary of Organic Compounds: Fifth Edition, Chapman and Hall, New York, 1982, 1. [all data]