1-Nonene, 1,1,2,3,3,4,4,5,5,6,6,7,7,8,8,9,9,9-octadecafluoro-
- Formula: C9F18
- Molecular weight: 450.0676
- IUPAC Standard InChIKey: UAFOIVDGAVVKTE-UHFFFAOYSA-N
- CAS Registry Number: 376-22-7
- Chemical structure:
View 3d structure (requires JavaScript / HTML 5) - Other names: perfluoronon-1-ene; perfluoro-1-nonene

Phase change data

Data compiled by: Thermodynamics Research Center, NIST Boulder Laboratories, Chris Muzny director
Quantity | Value | Units | Method | Reference | Comment |
---|---|---|---|---|---|
Tboil | 396. | K | N/A | Lazerte, Hals, et al., 1953 | Uncertainty assigned by TRC = 3. K |

Kovats' RI, non-polar column, isothermal

Column type | Active phase | Temperature (C) | I | Reference | Comment |
---|---|---|---|---|---|
Packed | Squalane | 50. | 423. | Müller, Dietrich, et al., 1983 |

References

Lazerte, Hals, et al., 1953
Lazerte, J.D.; Hals, L.J.; Ried, T.S.; Smith, G.H.,
Pyrolyses of the Salts of the Perfluoro Carboxylic Acids,
J. Am. Chem. Soc., 1953, 75, 4525. [all data]
Müller, Dietrich, et al., 1983
Müller, U.; Dietrich, P.; Prescher, D.,
Gaschromatographische Untersuchungen an Perfluor-Carbonverbindungen. II. Zur Gaschromatographischen Trennung von Gemischen Längerkettiger Perfluoralkane und Perfluoralkene,
J. Chromatogr., 1983, 259, 243-254, https://doi.org/10.1016/S0021-9673(01)88005-5
. [all data]