Mesulfenfos
- Formula: C10H15O4PS2
- Molecular weight: 294.327
- IUPAC Standard InChIKey: DLAPIMGBBDILHJ-UHFFFAOYSA-N
- CAS Registry Number: 3761-41-9
- Chemical structure:
View 3d structure (requires JavaScript / HTML 5) - Other names: Phosphorothioic acid, O,O-dimethyl O-(4-(methylsulfinyl)-m-tolyl) ester; O,O-Dimethyl O-(4-(methylsulfinyl)-m-tolyl) phosphorothioate; O,O-Dimethyl O-((4-methylthio)-m-tolyl)phosphorothioate sulfoxide; Fensulfoxide; Fenthion sulfoxide; Phosphorothioic acid, O,O-dimethyl O-(3-methyl-4-(methylsulfinyl)phenyl) ester; Mesulfenos; Mesulfenphos

Van Den Dool and Kratz RI, non-polar column, custom temperature program

Column type | Active phase | I | Reference | Comment |
---|---|---|---|---|
Capillary | VF-5MS | 2305.5 | Tret'yakov, 2007 | 30. m/0.25 mm/0.25 μm, He; Program: Multi-step temperature program; T(initial)=60C; T(final)=270C |

Normal alkane RI, non-polar column, isothermal

Column type | Active phase | Temperature (C) | I | Reference | Comment |
---|---|---|---|---|---|
Packed | OV-1 | 190. | 2230. | TSunoda, 1986 | Helium, Chromosorb W AW DMCS; Column length: 1. m |

Normal alkane RI, non-polar column, temperature ramp

Column type | Active phase | I | Reference | Comment |
---|---|---|---|---|
Packed | OV-1 | 2210. | TSunoda, 1986 | Helium, Chromosorb W AW DMCS, 4. K/min, 210. C @ 20. min; Column length: 1. m; Tstart: 140. C |

References

Tret'yakov, 2007
Tret'yakov, K.V.,
Retention Data. NIST Mass Spectrometry Data Center., NIST Mass Spectrometry Data Center, 2007. [all data]
TSunoda, 1986
TSunoda, N.,
Simultaneous determination of organophosphorous pesticides in forencis chemistry by gas-liquid chromatography with hydrogen flame ionization detector,
Eisei Kagaku, 1986, 32, 2, 91-100, https://doi.org/10.1248/jhs1956.32.91
. [all data]