1-Pyrrolidinecarboxaldehyde
- Formula: C5H9NO
- Molecular weight: 99.1311
- IUPAC Standard InChIKey: AGRIQBHIKABLPJ-UHFFFAOYSA-N
- CAS Registry Number: 3760-54-1
- Chemical structure:
View 3d structure (requires JavaScript / HTML 5) - Other names: N-Formylpyrrolidine; 1-Formylpyrrolidine; Prolinal; pyrrolidine-1-carbaldehyde

Phase change data

Data compiled by: Robert L. Brown and Stephen E. Stein
Reduced pressure boiling point
Tboil (K) | Pressure (bar) | Reference |
---|---|---|
368. to 371. | 0.023 | Frinton Laboratories Inc., 1986 |

Normal alkane RI, polar column, temperature ramp

Column type | Active phase | I | Reference | Comment |
---|---|---|---|---|
Capillary | Carbowax 20M | 1691. | Tressl, Rewicki, et al., 1985 | 2. K/min; Column length: 25. m; Column diameter: 0.32 mm; Tstart: 70. C; Tend: 180. C |

References

Frinton Laboratories Inc., 1986
Frinton Laboratories Inc.,
Catalog Number 11, Frinton Laboratories Inc., Vineland, NJ, 1986, 99. [all data]
Tressl, Rewicki, et al., 1985
Tressl, R.; Rewicki, D.; Helak, B.; Kamperschröer, H.,
Formation of pyrrolidines and piperidines on heating L-proline with reducing sugars,
J. Agric. Food Chem., 1985, 33, 5, 924-928, https://doi.org/10.1021/jf00065a037
. [all data]