Perfluorononanoic acid
- Formula: C9HF17O2
- Molecular weight: 464.0759
- IUPAC Standard InChIKey: UZUFPBIDKMEQEQ-UHFFFAOYSA-N
- CAS Registry Number: 375-95-1
- Chemical structure:
View 3d structure (requires JavaScript / HTML 5) - Species with the same structure:
- Other names: Nonanoic acid, heptadecafluoro-; 2,2,3,3,4,4,5,5,6,6,7,7,8,8,9,9,9-Heptadecafluorononanoic acid; perfluorononan-1-oic acid

Van Den Dool and Kratz RI, non-polar column, custom temperature program

Column type | Active phase | I | Reference | Comment |
---|---|---|---|---|
Capillary | VF-5MS | 1091. | Tretyakov, 2011 | 30. m/0.25 mm/0.25 μm, He; Program: Multi-step temperature program; T(initial)=60C; T(final)=270C |

References

Tretyakov, 2011
Tretyakov, K.V.,
Retention Data. NIST Mass Spectrometry Data Center., NIST Mass Spectrometry Data Center, 2011. [all data]