p-Pentylacetophenone
- Formula: C13H18O
- Molecular weight: 190.2814
- IUPAC Standard InChIKey: KBKGPMDADJLBEM-UHFFFAOYSA-N
- CAS Registry Number: 37593-02-5
- Chemical structure:
View 3d structure (requires JavaScript / HTML 5) - Other names: p-n-Pentylacetophenone; Acetophenone, 4'-pentyl-; Ethanone, 1-(4-pentylphenyl)-; 4'-Pentylacetophenone

Phase change data

Data compiled by: Robert L. Brown and Stephen E. Stein
Reduced pressure boiling point
Tboil (K) | Pressure (bar) | Reference |
---|---|---|
405. to 406. | 0.005 | Frinton Laboratories Inc., 1986 |

References

Frinton Laboratories Inc., 1986
Frinton Laboratories Inc.,
Catalog Number 11, Frinton Laboratories Inc., Vineland, NJ, 1986, 99. [all data]