Acetic acid, dichloro-, propyl ester
- Formula: C5H8Cl2O2
- Molecular weight: 171.022
- IUPAC Standard InChIKey: AHRFMMRLDGAHBM-UHFFFAOYSA-N
- CAS Registry Number: 37587-81-8
- Chemical structure:
View 3d structure (requires JavaScript / HTML 5) - Other names: Dichloroacetic acid, propyl ester; 1-Propanol, dichloroacetate; Propyl dichloroacetate

Condensed phase thermochemistry data

Data compiled by: Hussein Y. Afeefy, Joel F. Liebman, and Stephen E. Stein
Quantity | Value | Units | Method | Reference | Comment |
---|---|---|---|---|---|
ΔcH°liquid | -2636. ± 4. | kJ/mol | Ccb | Smith, Bjellerup, et al., 1953 | At 291.7 °K |
ΔcH°liquid | -2631. | kJ/mol | Ccb | Schjanberg, 1935 |

Phase change data

Data compiled by: Hussein Y. Afeefy, Joel F. Liebman, and Stephen E. Stein
Quantity | Value | Units | Method | Reference | Comment |
---|---|---|---|---|---|
ΔvapH° | 40. | kJ/mol | E | Schjanberg, 1935 |

Kovats' RI, non-polar column, isothermal

Column type | Active phase | Temperature (C) | I | Reference | Comment |
---|---|---|---|---|---|
Capillary | SE-30 | 100. | 964. | Haken and Korhonen, 1986 | N2; Column length: 25. m; Column diameter: 0.33 mm |
Capillary | SE-30 | 120. | 934. | Haken and Korhonen, 1986 | N2; Column length: 25. m; Column diameter: 0.33 mm |
Capillary | SE-30 | 140. | 969. | Haken and Korhonen, 1986 | N2; Column length: 25. m; Column diameter: 0.33 mm |
Capillary | SE-30 | 160. | 969. | Haken and Korhonen, 1986 | N2; Column length: 25. m; Column diameter: 0.33 mm |
Capillary | SE-30 | 80. | 979. | Haken and Korhonen, 1986 | N2; Column length: 25. m; Column diameter: 0.33 mm |
Capillary | SE-30 | 100. | 991. | Haken, Madden, et al., 1983 | Column length: 25. m; Column diameter: 0.22 mm |
Capillary | SE-30 | 140. | 976. | Haken, Madden, et al., 1983 | Column length: 25. m; Column diameter: 0.22 mm |
Capillary | SE-30 | 180. | 987. | Haken, Madden, et al., 1983 | Column length: 25. m; Column diameter: 0.22 mm |
Capillary | OV-101 | 80. | 974.5 | Komárek, Hornová, et al., 1982 | N2; Column length: 15. m; Column diameter: 0.22 mm |

Kovats' RI, polar column, isothermal

Column type | Active phase | Temperature (C) | I | Reference | Comment |
---|---|---|---|---|---|
Capillary | OV-351 | 120. | 1454. | Haken and Korhonen, 1986 | N2; Column length: 25. m; Column diameter: 0.33 mm |
Capillary | OV-351 | 140. | 1478. | Haken and Korhonen, 1986 | N2; Column length: 25. m; Column diameter: 0.33 mm |
Capillary | OV-351 | 160. | 1471. | Haken and Korhonen, 1986 | N2; Column length: 25. m; Column diameter: 0.33 mm |
Capillary | OV-351 | 180. | 1469. | Haken and Korhonen, 1986 | N2; Column length: 25. m; Column diameter: 0.33 mm |
Capillary | OV-351 | 200. | 1488. | Haken and Korhonen, 1986 | N2; Column length: 25. m; Column diameter: 0.33 mm |

References

Smith, Bjellerup, et al., 1953
Smith, L.; Bjellerup, L.; Krook, S.; Westermark, H.,
Heats of combustion of organic chloro compounds determined by the "quartz wool" method,
Acta Chem. Scand., 1953, 7, 65. [all data]
Schjanberg, 1935
Schjanberg, E.,
Die Verbrennungswarmen und die Refraktionsdaten einiger chlorsubstituierter Fettsauren und Ester.,
Z. Phys. Chem. Abt. A, 1935, 172, 197-233. [all data]
Haken and Korhonen, 1986
Haken, J.R.; Korhonen, I.O.O.,
Gas chromatography of homologous esters. XXXIII. Capillary chromatography of monochlorinated C1-C8 n-alkyl acetates, chloracetates, dichloroacetates and trichloroacetates,
J. Chromatogr., 1986, 357, 253-271, https://doi.org/10.1016/S0021-9673(01)95828-5
. [all data]
Haken, Madden, et al., 1983
Haken, J.K.; Madden, B.G.; Korhonen, I.O.O.,
Gas chromatography of homologous esters. XX. Capillary column studies of alkyl acetates, chloroacetates, dichloroacetates and trichloroacetates,
J. Chromatogr., 1983, 256, 221-229, https://doi.org/10.1016/S0021-9673(01)88235-2
. [all data]
Komárek, Hornová, et al., 1982
Komárek, K.; Hornová, L.; Churácek, J.,
Glass capillary gas chromatography of homologous series of esters. Separation of homologous series of esters of halogenated carboxylic acids on a glass capillary column with the non-polar stationary silicone phase OV-101,
J. Chromatogr., 1982, 244, 1, 142-147, https://doi.org/10.1016/S0021-9673(00)80131-4
. [all data]