3-Hexene, 2,4-dimethyl-, (Z)-
- Formula: C8H16
- Molecular weight: 112.2126
- IUPAC Standard InChIKey: VFCHHMABGOYOQI-VURMDHGXSA-N
- CAS Registry Number: 37549-89-6
- Chemical structure:
View 3d structure (requires JavaScript / HTML 5) - Stereoisomers:
- Other names: (Z)-2,4-Dimethylhex-3-ene; (Z)-3-Hexene, 2,4-dimethyl; cis-2,4-dimethyl-3-hexene

Phase change data

Data compiled as indicated in comments:
TRC - Thermodynamics Research Center, NIST Boulder Laboratories, Chris Muzny director
AC - William E. Acree, Jr., James S. Chickos
Quantity | Value | Units | Method | Reference | Comment |
---|---|---|---|---|---|
Tboil | 382. | K | N/A | Whitmore, Whitmore, et al., 1950 | Uncertainty assigned by TRC = 0.5 K; TRC |
Quantity | Value | Units | Method | Reference | Comment |
ΔvapH° | 38.5 | kJ/mol | N/A | Reid, 1972 | AC |

Kovats' RI, non-polar column, isothermal

View large format table.

Column type Active phase Temperature (C) I Reference Comment
CapillaryPetrocol DH30.737.3Soják, Addová, et al., 2004150. m/0.25 mm/1. μm, H2
CapillarySqualane30.724.9Soják, Addová, et al., 2004He; Column length: 93. m; Column diameter: 0.25 mm
CapillarySqualane100.727.Lulova, Leont'eva, et al., 1976He; Column length: 120. m; Column diameter: 0.25 mm
CapillarySqualane100.725.Mitra, Mohan, et al., 1974H2; Column length: 50. m; Column diameter: 0.2 mm
CapillarySqualane40.725.Matukuma, 1969N2; Column length: 91.4 m; Column diameter: 0.25 mm
PackedSqualane30.730.Tourres, 1967H2; Column length: 10. m
PackedSqualane50.730.Tourres, 1967H2; Column length: 10. m

Normal alkane RI, non-polar column, temperature ramp

View large format table.

Column type Active phase I Reference Comment
CapillaryPetrocol DH737.Sojak, Kubinec, et al., 2006150. m/0.25 mm/1.0 μm, 1. K/min; Tstart: 40. C; Tend: 300. C
CapillaryPetrocol DH738.Sojak, Kubinec, et al., 2006150. m/0.25 mm/1.0 μm, 1. K/min; Tstart: 40. C; Tend: 300. C
CapillaryPetrocol DH738.Sojak, Kubinec, et al., 2006150. m/0.25 mm/1.0 μm, 1. K/min; Tstart: 40. C; Tend: 300. C

References

Whitmore, Whitmore, et al., 1950
Whitmore, F.C.; Whitmore, H.E.; Cook, N.C.,
Hydrocarbons: X. Three New Octenes,
J. Am. Chem. Soc., 1950, 72, 51. [all data]
Reid, 1972
Reid, Robert C.,
Handbook on vapor pressure and heats of vaporization of hydrocarbons and related compounds, R. C. Wilhort and B. J. Zwolinski, Texas A Research Foundation. College Station, Texas(1971). 329 pages.$10.00,
AIChE J., 1972, 18, 6, 1278-1278, https://doi.org/10.1002/aic.690180637
. [all data]