p-Heptylaniline
- Formula: C13H21N
- Molecular weight: 191.3125
- IUPAC Standard InChIKey: BNEWZYZRLNNWNR-UHFFFAOYSA-N
- CAS Registry Number: 37529-27-4
- Chemical structure:
View 3d structure (requires JavaScript / HTML 5) - Other names: 4-Heptylaniline

Phase change data

Data compiled by: Robert L. Brown and Stephen E. Stein
Reduced pressure boiling point
Tboil (K) | Pressure (bar) | Reference |
---|---|---|
418. to 419. | 0.004 | Frinton Laboratories Inc., 1986 |

References

Frinton Laboratories Inc., 1986
Frinton Laboratories Inc.,
Catalog Number 11, Frinton Laboratories Inc., Vineland, NJ, 1986, 99. [all data]