Butanoic acid, heptafluoro-
- Formula: C4HF7O2
- Molecular weight: 214.0384
- IUPAC Standard InChIKey: YPJUNDFVDDCYIH-UHFFFAOYSA-N
- CAS Registry Number: 375-22-4
- Chemical structure:
View 3d structure (requires JavaScript / HTML 5) - Other names: Butyric acid, heptafluoro-; Heptafluoro-1-butanoic acid; Heptafluorobutanoic acid; Heptafluorobutyric acid; Perfluorobutanoic acid; Perfluorobutyric acid; Perfluoropropanecarboxylic acid; Heptafluoro-n-butyric acid; Kyselina heptafluormaselna; Butanoic acid, 2,2,3,3,4,4,4-heptafluoro-; NSC 820

Phase change data

Data compiled as indicated in comments:
BS - Robert L. Brown and Stephen E. Stein
AC - William E. Acree, Jr., James S. Chickos
Quantity | Value | Units | Method | Reference | Comment |
---|---|---|---|---|---|
Tboil | 392. to 394. | K | N/A | PCR Inc., 1990 | BS |
Reduced pressure boiling point
Tboil (K) | Pressure (atm) | Reference | Comment |
---|---|---|---|
393.2 | 0.993 | Aldrich Chemical Company Inc., 1990 | BS |
1028. | 0.158 | Farchan Laboratories, 1990 | BS |
Enthalpy of vaporization
ΔvapH (kcal/mol) | Temperature (K) | Method | Reference | Comment |
---|---|---|---|---|
12.0 ± 0.05 | 320. | EB | Steele, Chirico, et al., 2002 | Based on data from 310. to 426. K.; AC |
11.0 ± 0.05 | 360. | EB | Steele, Chirico, et al., 2002 | Based on data from 310. to 426. K.; AC |
9.8 ± 0.1 | 400. | EB | Steele, Chirico, et al., 2002 | Based on data from 310. to 426. K.; AC |
11.4 | 344. | A | Stephenson and Malanowski, 1987 | Based on data from 329. to 493. K.; AC |
11.3 | 368. | A | Stephenson and Malanowski, 1987 | Based on data from 353. to 393. K.; AC |

Reaction thermochemistry data

Data compiled by: John E. Bartmess
Individual Reactions
C4F7O2- + =
By formula: C4F7O2- + H+ = C4HF7O2
Quantity | Value | Units | Method | Reference | Comment |
---|---|---|---|---|---|
ΔrH° | 321.9 ± 2.2 | kcal/mol | G+TS | Caldwell, Renneboog, et al., 1989 | gas phase |
Quantity | Value | Units | Method | Reference | Comment |
ΔrG° | 314.9 ± 2.0 | kcal/mol | IMRE | Caldwell, Renneboog, et al., 1989 | gas phase |

Gas phase ion energetics data

Data compiled by: John E. Bartmess
De-protonation reactions
C4F7O2- + =
By formula: C4F7O2- + H+ = C4HF7O2
Quantity | Value | Units | Method | Reference | Comment |
---|---|---|---|---|---|
ΔrH° | 321.9 ± 2.2 | kcal/mol | G+TS | Caldwell, Renneboog, et al., 1989 | gas phase |
Quantity | Value | Units | Method | Reference | Comment |
ΔrG° | 314.9 ± 2.0 | kcal/mol | IMRE | Caldwell, Renneboog, et al., 1989 | gas phase |

Normal alkane RI, non-polar column, temperature ramp

Column type | Active phase | I | Reference | Comment |
---|---|---|---|---|
Capillary | OV-101 | 863. | Zenkevich and Rodin, 2002 | Nitrogen, 60. C @ 0. min, 4. K/min, 240. C @ 0. min; Column length: 25. m; Column diameter: 0.25 mm |

References

PCR Inc., 1990
PCR Inc.,
Research Chemicals Catalog 1990-1991, PCR Inc., Gainesville, FL, 1990, 1. [all data]
Aldrich Chemical Company Inc., 1990
Aldrich Chemical Company Inc.,
Catalog Handbook of Fine Chemicals, Aldrich Chemical Company, Inc., Milwaukee WI, 1990, 1. [all data]
Farchan Laboratories, 1990
Farchan Laboratories,
Research Chemicals Catalog, Farchan Laboratories, Gainesville, FL, 1990, 91. [all data]
Steele, Chirico, et al., 2002
Steele, W.V.; Chirico, R.D.; Knipmeyer, S.E.; Nguyen, A.,
Measurements of Vapor Pressure, Heat Capacity, and Density along the Saturation Line for Cyclopropane Carboxylic Acid, N , N -Diethylethanolamine, 2,3-Dihydrofuran, 5-Hexen-2-one, Perfluorobutanoic Acid, and 2-Phenylpropionaldehyde,
J. Chem. Eng. Data, 2002, 47, 4, 715-724, https://doi.org/10.1021/je010087j
. [all data]
Stephenson and Malanowski, 1987
Stephenson, Richard M.; Malanowski, Stanislaw,
Handbook of the Thermodynamics of Organic Compounds, 1987, https://doi.org/10.1007/978-94-009-3173-2
. [all data]
Caldwell, Renneboog, et al., 1989
Caldwell, G.; Renneboog, R.; Kebarle, P.,
Gas Phase Acidities of Aliphatic Carboxylic Acids, Based on Measurements of Proton Transfer Equilibria,
Can. J. Chem., 1989, 67, 4, 661, https://doi.org/10.1139/v89-092
. [all data]
Zenkevich and Rodin, 2002
Zenkevich, I.G.; Rodin, A.A.,
Gas Chromatographic One-Step Determination of Number of Hydroxyl Groups in Polyphenols with Mixed Derivatization Reagents,
Zh. Anal. Khim. (Rus.), 2002, 57, 7, 732-736. [all data]