Benzene, 1,3-bis(1-methylethenyl)-
- Formula: C12H14
- Molecular weight: 158.2396
- IUPAC Standard InChIKey: IBVPVTPPYGGAEL-UHFFFAOYSA-N
- CAS Registry Number: 3748-13-8
- Chemical structure:
View 3d structure (requires JavaScript / HTML 5) - Other names: Benzene, m-diisopropenyl-; m-Bis(1-methylvinyl)benzene; m-Diisopropenylbenzene; 1,3-Diisopropenylbenzene

Phase change data

Data compiled by: Robert L. Brown and Stephen E. Stein
Quantity | Value | Units | Method | Reference | Comment |
---|---|---|---|---|---|
Tboil | 504.2 | K | N/A | Aldrich Chemical Company Inc., 1990 | |
Tboil | 504. | K | N/A | Frinton Laboratories Inc., 1986 |

References

Aldrich Chemical Company Inc., 1990
Aldrich Chemical Company Inc.,
Catalog Handbook of Fine Chemicals, Aldrich Chemical Company, Inc., Milwaukee WI, 1990, 1. [all data]
Frinton Laboratories Inc., 1986
Frinton Laboratories Inc.,
Catalog Number 11, Frinton Laboratories Inc., Vineland, NJ, 1986, 99. [all data]