4-Penten-2-one, 4-methyl-
- Formula: C6H10O
- Molecular weight: 98.1430
- IUPAC Standard InChIKey: VADUDTKCGJKNDY-UHFFFAOYSA-N
- CAS Registry Number: 3744-02-3
- Chemical structure:
View 3d structure (requires JavaScript / HTML 5) - Other names: Isomesityl oxide; Isopropenyl acetone; CH3C(O)CH2C(CH3)=CH2; 4-Methyl-4-penten-2-one; 2-Methylene-4-pentanal; 2-Methyl-1-penten-4-one

Phase change data

Data compiled as indicated in comments:
TRC - Thermodynamics Research Center, NIST Boulder Laboratories, Chris Muzny director
AC - William E. Acree, Jr., James S. Chickos
Quantity | Value | Units | Method | Reference | Comment |
---|---|---|---|---|---|
Tfus | 200.55 | K | N/A | Stross, Monger, et al., 1947 | Uncertainty assigned by TRC = 0.2 K; TRC |
Quantity | Value | Units | Method | Reference | Comment |
ΔvapH° | 41.9 | kJ/mol | N/A | Ambrose, Ellender, et al., 1975 | Based on data from 286. to 461. K.; AC |
Enthalpy of vaporization
ΔvapH (kJ/mol) | Temperature (K) | Method | Reference | Comment |
---|---|---|---|---|
36.9 | 404. | A | Stephenson and Malanowski, 1987 | Based on data from 389. to 461. K.; AC |
41.1 | 321. | MM | Stephenson and Malanowski, 1987 | Based on data from 306. to 398. K. See also Stross, Monger, et al., 1947, 2 and Dykyj, 1972.; AC |

References

Stross, Monger, et al., 1947
Stross, F.H.; Monger, J.M.; Finch, H. deV.,
Isolation and Purification of the Two Isomers of Mesityl Oxide,
J. Am. Chem. Soc., 1947, 69, 1627-8. [all data]
Ambrose, Ellender, et al., 1975
Ambrose, D.; Ellender, J.H.; Lees, E.B.; Sprake, C.H.S.; Townsend, R.,
Thermodynamic properties of organic oxygen compounds XXXVIII. Vapour pressures of some aliphatic ketones,
The Journal of Chemical Thermodynamics, 1975, 7, 5, 453-472, https://doi.org/10.1016/0021-9614(75)90275-X
. [all data]
Stephenson and Malanowski, 1987
Stephenson, Richard M.; Malanowski, Stanislaw,
Handbook of the Thermodynamics of Organic Compounds, 1987, https://doi.org/10.1007/978-94-009-3173-2
. [all data]
Stross, Monger, et al., 1947, 2
Stross, F.H.; Monger, J.M.; Finch, H. de V.,
The Isolation and Purification of Two Isomers of Mesityl Oxide,
J. Am. Chem. Soc., 1947, 69, 7, 1627-1628, https://doi.org/10.1021/ja01199a016
. [all data]
Dykyj, 1972
Dykyj, J.,
Petrochemia, 1972, 12, 1, 13. [all data]