2,3-Diazabicyclo[2.2.2]octa-2,5-diene N-oxide
- Formula: C6H8N2O
- Molecular weight: 124.1405
- IUPAC Standard InChIKey: REZPTDSIISBQTI-UHFFFAOYSA-N
- CAS Registry Number: 37436-17-2
- Chemical structure:
View 3d structure (requires JavaScript / HTML 5) - Permanent link for this species. Use this link for bookmarking this species for future reference.

Gas phase thermochemistry data

Data compiled by: Hussein Y. Afeefy, Joel F. Liebman, and Stephen E. Stein
Quantity | Value | Units | Method | Reference | Comment |
---|---|---|---|---|---|
ΔfH°gas | 221.0 ± 2.1 | kJ/mol | Ccb | Bystrom, 1983 |

Reaction thermochemistry data

Data compiled by: Hussein Y. Afeefy, Joel F. Liebman, and Stephen E. Stein
Individual Reactions
By formula: C6H8N2O = N2O + C6H8
Quantity | Value | Units | Method | Reference | Comment |
---|---|---|---|---|---|
ΔrH° | -3.5 ± 0.3 | kJ/mol | Kin | Oth, Olsen, et al., 1977 | liquid phase; solvent: THF; At 452 K |

References

Bystrom, 1983
Bystrom, K.,
Molecular mechanics studies of enthalpies of formation and strain energies of azoxyalkanes,
J. Comput. Chem., 1983, 4, 308-312. [all data]
Oth, Olsen, et al., 1977
Oth, J.F.M.; Olsen, H.; Synder, J.P.,
Energetics of heteroextrusion reactions. N2 vs. N2O,
J. Am. Chem. Soc., 1977, 99, 8505-8507. [all data]