4-Ethylcyclopentene
- Formula: C7H12
- Molecular weight: 96.1702
- IUPAC Standard InChIKey: XWIUHPFMOVSNBE-UHFFFAOYSA-N
- CAS Registry Number: 3742-38-9
- Chemical structure:
View 3d structure (requires JavaScript / HTML 5) - Permanent link for this species. Use this link for bookmarking this species for future reference.

Phase change data

Data compiled as indicated in comments:
TRC - Thermodynamics Research Center, NIST Boulder Laboratories, Chris Muzny director
AC - William E. Acree, Jr., James S. Chickos
Quantity | Value | Units | Method | Reference | Comment |
---|---|---|---|---|---|
Tboil | 371.4 | K | N/A | Pinchas, Shabtai, et al., 1959 | Uncertainty assigned by TRC = 3. K; TRC |
Enthalpy of vaporization
ΔvapH (kJ/mol) | Temperature (K) | Method | Reference | Comment |
---|---|---|---|---|
36.5 | 303. | A | Stephenson and Malanowski, 1987 | Based on data from 288. to 435. K. See also Kkykj and Repas, 1973.; AC |

References

Pinchas, Shabtai, et al., 1959
Pinchas, S.; Shabtai, J.; Herling, J.; Gil-Av, E.,
The Preparation and Infrared Spectra of the Three Ethylcyclopentenes, Methylene-, and ethylidenecyclopentane,
J. Inst. Pet., 1959, 45, 311. [all data]
Stephenson and Malanowski, 1987
Stephenson, Richard M.; Malanowski, Stanislaw,
Handbook of the Thermodynamics of Organic Compounds, 1987, https://doi.org/10.1007/978-94-009-3173-2
. [all data]
Kkykj and Repas, 1973
Kkykj, J.; Repas, M.,
Petrochemia, 1973, 13, 179. [all data]