(1,1'-Bipyrrolidine)-2,2',5,5'-tetrone
- Formula: C8H8N2O4
- Molecular weight: 196.1601
- IUPAC Standard InChIKey: VEUBNMYWDIAMNQ-UHFFFAOYSA-N
- CAS Registry Number: 3741-24-0
- Chemical structure:
View 3d structure (requires JavaScript / HTML 5) - Species with the same structure:

Condensed phase thermochemistry data

Data compiled by: Hussein Y. Afeefy, Joel F. Liebman, and Stephen E. Stein
Quantity | Value | Units | Method | Reference | Comment |
---|---|---|---|---|---|
ΔfH°solid | -169.55 ± 0.40 | kcal/mol | Ccb | Coleman and Skinner, 1966 | |
Quantity | Value | Units | Method | Reference | Comment |
ΔcH°solid | -856.13 ± 0.39 | kcal/mol | Ccb | Coleman and Skinner, 1966 |

References

Coleman and Skinner, 1966
Coleman, D.J.; Skinner, H.A.,
Heats of combustion of organic compounds of nitrogen. Part 4.- Succinimide, N,N'-bisuccinimide and 2,5,2',5'-tetramethyl-dipyrryl-(1,1'),
Trans. Faraday Soc., 1966, 62, 2057-2062. [all data]