Cyclopentane, pentyl-
- Formula: C10H20
- Molecular weight: 140.2658
- IUPAC Standard InChIKey: HPQURZRDYMUHJI-UHFFFAOYSA-N
- CAS Registry Number: 3741-00-2
- Chemical structure:
View 3d structure (requires JavaScript / HTML 5) - Other names: Pentane, 1-cyclopentyl-; Cyclopentane, n-pentyl-; Pentylcyclopentane; n-Pentylcyclopentane; n-Amylcyclopentane

Gas phase thermochemistry data

Data compiled by: Hussein Y. Afeefy, Joel F. Liebman, and Stephen E. Stein
Quantity | Value | Units | Method | Reference | Comment |
---|---|---|---|---|---|
ΔfH°gas | -188.9 ± 1.5 | kJ/mol | Ccb | Prosen, Johnson, et al., 1946 | Heat of combustion of the gas |

Condensed phase thermochemistry data

Data compiled by: Hussein Y. Afeefy, Joel F. Liebman, and Stephen E. Stein
Quantity | Value | Units | Method | Reference | Comment |
---|---|---|---|---|---|
ΔcH°liquid | -6604.6 ± 1.4 | kJ/mol | Ccb | Prosen, Johnson, et al., 1946 | Heat of combustion of the gas; Corresponding ΔfHºliquid = -188.8 kJ/mol (simple calculation by NIST; no Washburn corrections) |

Phase change data

Data compiled as indicated in comments:
TRC - Thermodynamics Research Center, NIST Boulder Laboratories, Chris Muzny director
AC - William E. Acree, Jr., James S. Chickos
Quantity | Value | Units | Method | Reference | Comment |
---|---|---|---|---|---|
Tboil | 453. | K | N/A | Larsen, Thorpe, et al., 1942 | Uncertainty assigned by TRC = 2. K; ~; TRC |
Quantity | Value | Units | Method | Reference | Comment |
ΔvapH° | 51.0 | kJ/mol | N/A | Reid, 1972 | AC |

Henry's Law data

Data compiled by: Rolf Sander
Henry's Law constant (water solution)
kH(T) = k°H exp(d(ln(kH))/d(1/T) ((1/T) - 1/(298.15 K)))
k°H = Henry's law constant for solubility in water at 298.15 K (mol/(kg*bar))
d(ln(kH))/d(1/T) = Temperature dependence constant (K)
k°H (mol/(kg*bar)) | d(ln(kH))/d(1/T) (K) | Method | Reference | Comment |
---|---|---|---|---|
0.00054 | Q | N/A | missing citation give several references for the Henry's law constants but don't assign them to specific species. | |
0.00055 | L | N/A |

Gas phase ion energetics data

Data compiled as indicated in comments:
LLK - Sharon G. Lias, Rhoda D. Levin, and Sherif A. Kafafi

Ionization energy determinations

IE (eV) Method Reference Comment
9.91 ± 0.05PERang, Paldoia, et al., 1974LLK

References

Prosen, Johnson, et al., 1946
Prosen, E.J.; Johnson, W.H.; Rossini, F.D.,
Heats of formation and combustion of the normal alkylcyclopentanes and cyclohexanes and the increment per CH2 group for several homologous series of hydrocarbons,
J. Res. NBS, 1946, 37, 51-56. [all data]
Larsen, Thorpe, et al., 1942
Larsen, R.G.; Thorpe, R.E.; Armfield, F.A.,
Oxidation Characteristics of Pure Hydrocarbons,
Ind. Eng. Chem., 1942, 34, 183. [all data]
Reid, 1972
Reid, Robert C.,
Handbook on vapor pressure and heats of vaporization of hydrocarbons and related compounds, R. C. Wilhort and B. J. Zwolinski, Texas A Research Foundation. College Station, Texas(1971). 329 pages.$10.00,
AIChE J., 1972, 18, 6, 1278-1278, https://doi.org/10.1002/aic.690180637
. [all data]