Benzeneacetic acid, 2-nitro-
- Formula: C8H7NO4
- Molecular weight: 181.1455
- IUPAC Standard InChIKey: WMUZDBZPDLHUMW-UHFFFAOYSA-N
- CAS Registry Number: 3740-52-1
- Chemical structure:
View 3d structure (requires JavaScript / HTML 5) - Other names: o-Nitrophenylacetic acid; 2-Nitrophenylacetic acid; (ortho-Nitrophenyl)acetic acid; Acetic acid, (o-nitrophenyl)-; 2-(o-Nitrophenyl)acetic acid; 2-Nitrobenzeneacetic acid

Phase change data

Data compiled by: Thermodynamics Research Center, NIST Boulder Laboratories, Chris Muzny director
Quantity | Value | Units | Method | Reference | Comment |
---|---|---|---|---|---|
Tfus | 411.15 | K | N/A | Beringer, Brierley, et al., 1953 | Uncertainty assigned by TRC = 1.5 K |

References

Beringer, Brierley, et al., 1953
Beringer, F.M.; Brierley, A.; Drexler, M.; Gindler, E.M.; Lumpkin, C.C.,
Diaryliodonium Salts II. The Phenylation of Organic and Inorganic Bases,
J. Am. Chem. Soc., 1953, 75, 2708. [all data]