1,1,1-Trifluoro-2-propanol
- Formula: C3H5F3O
- Molecular weight: 114.0664
- IUPAC Standard InChIKey: GILIYJDBJZWGBG-UHFFFAOYSA-N
- CAS Registry Number: 374-01-6
- Chemical structure:
View 3d structure (requires JavaScript / HTML 5) - Other names: 1,1,1-Trifluoroisopropanol; 1,1,1-Trifluoropropanol-2; 2-Propanol, 1,1,1-trifluoro-; 1-Methyl-2,2,2-trifluoroethanol; 1,1,1-Trifluoropropan-2-ol

Phase change data

Data compiled as indicated in comments:
ALS - Hussein Y. Afeefy, Joel F. Liebman, and Stephen E. Stein
AC - William E. Acree, Jr., James S. Chickos
Quantity | Value | Units | Method | Reference | Comment |
---|---|---|---|---|---|
ΔvapH° | 44.79 | kJ/mol | V | Rochester and Symonds, 1973 | ALS |
ΔvapH° | 44.8 | kJ/mol | MM | Rochester and Symonds, 1973 | Based on data from 294. to 333. K.; AC |
Enthalpy of vaporization
ΔvapH (kJ/mol) | Temperature (K) | Method | Reference | Comment |
---|---|---|---|---|
44.2 | 307. | A,MM | Stephenson and Malanowski, 1987 | Based on data from 292. to 333. K. See also Rochester and Symonds, 1973 and Boublik, Fried, et al., 1984.; AC |

Reaction thermochemistry data

Data compiled by: John E. Bartmess
Individual Reactions
C3H4F3O- + =
By formula: C3H4F3O- + H+ = C3H5F3O
Quantity | Value | Units | Method | Reference | Comment |
---|---|---|---|---|---|
ΔrH° | 1507. ± 8.8 | kJ/mol | G+TS | Caldwell, McMahon, et al., 1985 | gas phase; value altered from reference due to change in acidity scale |
Quantity | Value | Units | Method | Reference | Comment |
ΔrG° | 1480. ± 8.4 | kJ/mol | IMRE | Caldwell, McMahon, et al., 1985 | gas phase; value altered from reference due to change in acidity scale |

Henry's Law data

Data compiled by: Rolf Sander
Henry's Law constant (water solution)
kH(T) = k°H exp(d(ln(kH))/d(1/T) ((1/T) - 1/(298.15 K)))
k°H = Henry's law constant for solubility in water at 298.15 K (mol/(kg*bar))
d(ln(kH))/d(1/T) = Temperature dependence constant (K)
k°H (mol/(kg*bar)) | d(ln(kH))/d(1/T) (K) | Method | Reference |
---|---|---|---|
45. | 6300. | M | N/A |

Gas phase ion energetics data

Data compiled by: John E. Bartmess
De-protonation reactions
C3H4F3O- + =
By formula: C3H4F3O- + H+ = C3H5F3O
Quantity | Value | Units | Method | Reference | Comment |
---|---|---|---|---|---|
ΔrH° | 1507. ± 8.8 | kJ/mol | G+TS | Caldwell, McMahon, et al., 1985 | gas phase; value altered from reference due to change in acidity scale |
Quantity | Value | Units | Method | Reference | Comment |
ΔrG° | 1480. ± 8.4 | kJ/mol | IMRE | Caldwell, McMahon, et al., 1985 | gas phase; value altered from reference due to change in acidity scale |

References

Rochester and Symonds, 1973
Rochester, C.H.; Symonds, J.R.,
Thermodynamic studies of fluoroalchols Part 1.-Vapour pressures and enthalpies of vaporization,
J. Chem. Soc. Faraday Trans. 1, 1973, 69, 1267. [all data]
Stephenson and Malanowski, 1987
Stephenson, Richard M.; Malanowski, Stanislaw,
Handbook of the Thermodynamics of Organic Compounds, 1987, https://doi.org/10.1007/978-94-009-3173-2
. [all data]
Boublik, Fried, et al., 1984
Boublik, T.; Fried, V.; Hala, E.,
The Vapour Pressures of Pure Substances: Selected Values of the Temperature Dependence of the Vapour Pressures of Some Pure Substances in the Normal and Low Pressure Region, 2nd ed., Elsevier, New York, 1984, 972. [all data]
Caldwell, McMahon, et al., 1985
Caldwell, G.; McMahon, T.B.; Kebarle, P.; Bartmess, J.E.; Kiplinger, J.P.,
Methyl substituent effects in the gas phase acidities of halosubstituted oxygen acids. A realignment with substituent effects in solution,
J. Am. Chem. Soc., 1985, 107, 80. [all data]