1-Propene, 3,3,3-trifluoro-2-methyl-
- Formula: C4H5F3
- Molecular weight: 110.0777
- IUPAC Standard InChIKey: VJOAJCOCCYFXPR-UHFFFAOYSA-N
- CAS Registry Number: 374-00-5
- Chemical structure:
View 3d structure (requires JavaScript / HTML 5) - Other names: Propene, 3,3,3-trifluoro-2-methyl-; 3,3,3-Trifluoro-2-methylpropene; CH3C(CF3)=CH2; 2-Trifluoromethylpropene

Phase change data

Data compiled by: Robert L. Brown and Stephen E. Stein
Quantity | Value | Units | Method | Reference | Comment |
---|---|---|---|---|---|
Tboil | 279. to 280. | K | N/A | PCR Inc., 1990 |

Reaction thermochemistry data

Data compiled by: John E. Bartmess
Individual Reactions
C4H4F3- + =
By formula: C4H4F3- + H+ = C4H5F3
Quantity | Value | Units | Method | Reference | Comment |
---|---|---|---|---|---|
ΔrH° | 1565. ± 8.8 | kJ/mol | G+TS | Bartmess and Burnham, 1984 | gas phase; value altered from reference due to change in acidity scale |
Quantity | Value | Units | Method | Reference | Comment |
ΔrG° | 1537. ± 8.4 | kJ/mol | IMRE | Bartmess and Burnham, 1984 | gas phase; value altered from reference due to change in acidity scale |

Gas phase ion energetics data

Data compiled by: John E. Bartmess
De-protonation reactions
C4H4F3- + =
By formula: C4H4F3- + H+ = C4H5F3
Quantity | Value | Units | Method | Reference | Comment |
---|---|---|---|---|---|
ΔrH° | 1565. ± 8.8 | kJ/mol | G+TS | Bartmess and Burnham, 1984 | gas phase; value altered from reference due to change in acidity scale |
Quantity | Value | Units | Method | Reference | Comment |
ΔrG° | 1537. ± 8.4 | kJ/mol | IMRE | Bartmess and Burnham, 1984 | gas phase; value altered from reference due to change in acidity scale |

References

PCR Inc., 1990
PCR Inc.,
Research Chemicals Catalog 1990-1991, PCR Inc., Gainesville, FL, 1990, 1. [all data]
Bartmess and Burnham, 1984
Bartmess, J.E.; Burnham, R.,
Effect of central substituents on the gas phase acidities of propenes,
J. Org. Chem., 1984, 49, 1382. [all data]