Sulfur, pentafluoro(trifluoromethyl)-, (OC-6-21)-
- Formula: CF8S
- Molecular weight: 196.063
- IUPAC Standard InChIKey: QIYZKVMAFMDRTP-UHFFFAOYSA-N
- CAS Registry Number: 373-80-8
- Chemical structure:
View 3d structure (requires JavaScript / HTML 5) - Other names: Sulfur, pentafluoro(trifluoromethyl)-; Pentafluoro(trifluoromethyl)sulfur; CF3SF5; Trifluoromethylsulfur pentafluoride

Gas phase thermochemistry data

Quantity | Value | Units | Method | Reference | Comment |
---|---|---|---|---|---|
ΔfH°gas | -1717.05 | kJ/mol | Review | Chase, 1998 | Data last reviewed in December, 1977 |
Quantity | Value | Units | Method | Reference | Comment |
S°gas,1 bar | 379.94 | J/mol*K | Review | Chase, 1998 | Data last reviewed in December, 1977 |
Gas Phase Heat Capacity (Shomate Equation)
Cp° = A + B*t + C*t2 + D*t3 +
E/t2
H° − H°298.15= A*t + B*t2/2 +
C*t3/3 + D*t4/4 − E/t + F − H
S° = A*ln(t) + B*t + C*t2/2 + D*t3/3 −
E/(2*t2) + G
Cp = heat capacity (J/mol*K)
H° = standard enthalpy (kJ/mol)
S° = standard entropy (J/mol*K)
t = temperature (K) / 1000.
View plot Requires a JavaScript / HTML 5 canvas capable browser.
Temperature (K) | 298. to 1100. | 1100. to 6000. |
---|---|---|
A | 85.98162 | 226.9586 |
B | 333.0815 | 0.942647 |
C | -299.5430 | -0.190579 |
D | 96.29978 | 0.013184 |
E | -1.961293 | -13.83197 |
F | -1761.623 | -1824.107 |
G | 386.1188 | 594.7430 |
H | -1717.051 | -1717.051 |
Reference | Chase, 1998 | Chase, 1998 |
Comment | Data last reviewed in December, 1977 | Data last reviewed in December, 1977 |

Phase change data

Data compiled by: William E. Acree, Jr., James S. Chickos
Enthalpy of vaporization
ΔvapH (kJ/mol) | Temperature (K) | Method | Reference | Comment |
---|---|---|---|---|
20.2 | 253. | I | Kul, DesMarteau, et al., 2001 | Based on data from 223. to 252. K. |
23.8 | 247. | A | Stephenson and Malanowski, 1987 | Based on data from 205. to 262. K. See also Dykyj, Svoboda, et al., 1999. |

Gas phase ion energetics data

Data compiled by: Michael M. Meot-Ner (Mautner)
Gas basicity at 298K
Gas basicity (review) (kJ/mol) | Reference | Comment |
---|---|---|
640. ± 10. | Pepi, Ricci, et al., 2005 | T = 298K; PA(SF5CH3) bracketed between COS and CH3Cl based on dissociative PT reactions with large entropy changes, that may affect the kinetics. However, the derived PA agrees with ab initio values. |

References

Chase, 1998
Chase, M.W., Jr.,
NIST-JANAF Themochemical Tables, Fourth Edition,
J. Phys. Chem. Ref. Data, Monograph 9, 1998, 1-1951. [all data]
Kul, DesMarteau, et al., 2001
Kul, Ismail; DesMarteau, Darryl D.; Beyerlein, Adolph L.,
Vapor--liquid equilibria for CF3OCF2H/fluorinated ethane and CF3SF5/fluorinated ethane mixtures as potential R22 alternatives,
Fluid Phase Equilibria, 2001, 185, 1-2, 241-253, https://doi.org/10.1016/S0378-3812(01)00474-5
. [all data]
Stephenson and Malanowski, 1987
Stephenson, Richard M.; Malanowski, Stanislaw,
Handbook of the Thermodynamics of Organic Compounds, 1987, https://doi.org/10.1007/978-94-009-3173-2
. [all data]
Dykyj, Svoboda, et al., 1999
Dykyj, J.; Svoboda, J.; Wilhoit, R.C.; Frenkel, M.L.; Hall, K.R.,
Vapor Pressure of Chemicals: Part A. Vapor Pressure and Antoine Constants for Hydrocarbons and Sulfur, Selenium, Tellurium and Hydrogen Containing Organic Compounds, Springer, Berlin, 1999, 373. [all data]
Pepi, Ricci, et al., 2005
Pepi, F.; Ricci, A.; Di Stefano, M.; Rosi, M.,
Gas phase protonation of trifluoromethyl sulfur pentafluoride,
Phys. Chem. Chem. Phys., 2005, 7, 1181. [all data]