Disopyramide
- Formula: C21H29N3O
- Molecular weight: 339.4745
- IUPAC Standard InChIKey: UVTNFZQICZKOEM-UHFFFAOYSA-N
- CAS Registry Number: 3737-09-5
- Chemical structure:

Phase change data

Data compiled by: William E. Acree, Jr., James S. Chickos
Enthalpy of fusion
ΔfusH (kcal/mol) | Temperature (K) | Method | Reference |
---|---|---|---|
6.38 | 363.7 | DSC | Wassvik, Holmén, et al., 2008 |

Kovats' RI, non-polar column, isothermal

View large format table.

Column type Active phase Temperature (C) I Reference Comment
PackedSE-30240.2490.Musumarra, Scarlata, et al., 1987N2, 1% se-30 on Anachrom ABS(80-100mesh); Column length: 2. m

Kovats' RI, non-polar column, temperature ramp

View large format table.

Column type Active phase I Reference Comment
PackedOV-1012490.Maurer, 1990N2, Chromosorb G HP, 100. C @ 3. min, 30. K/min, 310. C @ 5. min; Column length: 0.60 m

Van Den Dool and Kratz RI, non-polar column, temperature ramp

View large format table.

Column type Active phase I Reference Comment
CapillaryVF-5MS2566.1Tretyakov, 201430. m/0.25 mm/0.25 μm, He; Tstart: 60. C; Tend: 270. C
CapillarySPB-12525.Christ, Noomano, et al., 198830. m/0.75 mm/1.0 μm, He, 10. K/min, 280. C @ 12. min; Tstart: 160. C
CapillarySE-302470.Anderson and Stafford, 198315. m/0.25 mm/0.25 μm, He, 5. K/min; Tstart: 100. C; Tend: 295. C

Van Den Dool and Kratz RI, non-polar column, custom temperature program

View large format table.

Column type Active phase I Reference Comment
CapillaryBP-12489.Stowell and Wilson, 198712. m/0.22 mm/0.25 μm, He; Program: 120C => 8C/min => 270C => 25C/min => 300C

References

Wassvik, Holmén, et al., 2008
Wassvik, Carola M.; Holmén, Anders G.; Draheim, Rieke; Artursson, Per; Bergström, Christel A.S.,
Molecular Characteristics for Solid-State Limited Solubility,
J. Med. Chem., 2008, 51, 10, 3035-3039, https://doi.org/10.1021/jm701587d
. [all data]