Palmitoleic acid
- Formula: C16H30O2
- Molecular weight: 254.4082
- IUPAC Standard InChIKey: SECPZKHBENQXJG-FPLPWBNLSA-N
- CAS Registry Number: 373-49-9
- Chemical structure:
View 3d structure (requires JavaScript / HTML 5) - Stereoisomers:
- Other names: cis-9-Hexadecenoic acid; 9-Hexadecenoic acid, (Z)-; cis-δ9-Hexadecenoic acid; Palmitolinoleic acid; 9-cis-Hexadecenoic acid; (Z)-9-Hexadecenoic acid; (E)-9-Hexadecenoic acid; (Z)-Palmitoleic acid; cis-Hexadec-9-enoic acid; cis-Palmitoleic acid; trans-9-Hexadecenoic acid; (Z)-hexadec-9-enoic acid

Condensed phase thermochemistry data

Data compiled by: Hussein Y. Afeefy, Joel F. Liebman, and Stephen E. Stein
Quantity | Value | Units | Method | Reference | Comment |
---|---|---|---|---|---|
ΔfH°liquid | -713.4 | kJ/mol | Chyd | Rogers, Hoyte, et al., 1978 |

Phase change data

Data compiled as indicated in comments:
BS - Robert L. Brown and Stephen E. Stein
AC - William E. Acree, Jr., James S. Chickos
Reduced pressure boiling point
Tboil (K) | Pressure (bar) | Reference | Comment |
---|---|---|---|
435.2 | 0.0008 | Aldrich Chemical Company Inc., 1990 | BS |
Enthalpy of fusion
ΔfusH (kJ/mol) | Temperature (K) | Reference | Comment |
---|---|---|---|
32.1 | 275.2 | Sato, Yano, et al., 1997 | AC |

Reaction thermochemistry data

Data compiled by: Hussein Y. Afeefy, Joel F. Liebman, and Stephen E. Stein
Individual Reactions
By formula: H2 + C16H30O2 = C16H32O2
Quantity | Value | Units | Method | Reference | Comment |
---|---|---|---|---|---|
ΔrH° | -125.1 ± 1.0 | kJ/mol | Chyd | Rogers, Hoyte, et al., 1978 | liquid phase; solvent: Hexane |

Kovats' RI, non-polar column, temperature ramp

Data compiled by: NIST Mass Spectrometry Data Center, William E. Wallace, director

Column type CapillaryCapillaryCapillaryCapillaryCapillary
Active phase BP-1BP-1BP-1BP-1BP-1
Column length (m) 25.30.60.30.25.
Carrier gas N2N2N2N2N2
Substrate
Column diameter (mm) 0.320.320.320.320.55
Phase thickness (μm) 0.250.250.250.250.25
Tstart (C) 60.60.60.60.60.
Tend (C) 220.220.220.220.220.
Heat rate (K/min) 5.5.5.5.5.
Initial hold (min)
Final hold (min) 13.3. 13.15.
I 1929.1931.1945.1936.1931.
ReferenceRaina, Verma, et al., 2006Srivastava, Srivastava, et al., 2006Raina, Lal, et al., 2002Shawl, Srivastava, et al., 2002Jain, Srivastava, et al., 2001
Comment MSDC-RI MSDC-RI MSDC-RI MSDC-RI MSDC-RI

References

Rogers, Hoyte, et al., 1978
Rogers, D.W.; Hoyte, O.P.A.; Ho, R.K.C.,
Heats of hydrogenation of large molecules. Part 2. Six unsaturated and polyunsaturated fatty acids,
J. Chem. Soc. Faraday Trans. 1, 1978, 74, 46-52. [all data]
Aldrich Chemical Company Inc., 1990
Aldrich Chemical Company Inc.,
Catalog Handbook of Fine Chemicals, Aldrich Chemical Company, Inc., Milwaukee WI, 1990, 1. [all data]
Sato, Yano, et al., 1997
Sato, K.; Yano, J.; Kawada, I.; Kawano, M.; Kaneko, F.; Suzuki, M.,
Polymorphic behavior of gondoic acid and phase behavior of its binary mixtures with asclepic acid and oleic acid,
J Amer Oil Chem Soc, 1997, 74, 9, 1153-1159, https://doi.org/10.1007/s11746-997-0039-7
. [all data]