1,8-Diaminooctane
- Formula: C8H20N2
- Molecular weight: 144.2578
- IUPAC Standard InChIKey: PWGJDPKCLMLPJW-UHFFFAOYSA-N
- CAS Registry Number: 373-44-4
- Chemical structure:
View 3d structure (requires JavaScript / HTML 5) - Other names: Octamethylenediamine; 1,8-Octanediamine; 1,8-Octamethylenediamine; 1,8-Octylenediamine

Phase change data

Data compiled as indicated in comments:
BS - Robert L. Brown and Stephen E. Stein
AC - William E. Acree, Jr., James S. Chickos
Quantity | Value | Units | Method | Reference | Comment |
---|---|---|---|---|---|
Tboil | 498.7 | K | N/A | Aldrich Chemical Company Inc., 1990 | BS |
Reduced pressure boiling point
Tboil (K) | Pressure (bar) | Reference | Comment |
---|---|---|---|
408.2 | 0.027 | Weast and Grasselli, 1989 | BS |
Enthalpy of fusion
ΔfusH (kJ/mol) | Temperature (K) | Method | Reference | Comment |
---|---|---|---|---|
50.51 | 324.9 | DSC | Khimeche and Dahmani, 2006 | AC |
50.98 | 324.8 | DSC | Dall'Acqua, Della Gatta, et al., 2002 | AC |

Gas phase ion energetics data

Data compiled by: Michael M. Meot-Ner (Mautner)
Gas basicity at 298K
Gas basicity (review) (kJ/mol) | Reference | Comment |
---|---|---|
946. ± 21. | Gross, Rodriguez-Cruz, et al., 1995 | T = 300K; Di-n-propylamine; Tri-n-butylamine. Reference GBs readjusted to Hunter and Lias, 1998. Cited uncertainty is half of the ΔGB between the bracketing bases |

Van Den Dool and Kratz RI, non-polar column, custom temperature program

Column type | Active phase | I | Reference | Comment |
---|---|---|---|---|
Capillary | DB-1 | 1273. | Peng, 2000 | 15. m/0.53 mm/1. μm, He; Program: 40C(3min) => 8C/min => 200(1min) => 5C/min => 300C(25min) |

Van Den Dool and Kratz RI, polar column, temperature ramp

Column type | Active phase | I | Reference | Comment |
---|---|---|---|---|
Capillary | HP-Wax | 1850. | Peng, 2000 | 15. m/0.53 mm/1. μm, He, 40. C @ 3. min, 5. K/min, 220. C @ 30. min |

References

Aldrich Chemical Company Inc., 1990
Aldrich Chemical Company Inc.,
Catalog Handbook of Fine Chemicals, Aldrich Chemical Company, Inc., Milwaukee WI, 1990, 1. [all data]
Weast and Grasselli, 1989
CRC Handbook of Data on Organic Compounds, 2nd Editon, Weast,R.C and Grasselli, J.G., ed(s)., CRC Press, Inc., Boca Raton, FL, 1989, 1. [all data]
Khimeche and Dahmani, 2006
Khimeche, Kamel; Dahmani, Abdallah,
Solid-Liquid Equilibria of Naphthalene + Alkanediamine Mixtures,
J. Chem. Eng. Data, 2006, 51, 2, 382-385, https://doi.org/10.1021/je0502851
. [all data]
Dall'Acqua, Della Gatta, et al., 2002
Dall'Acqua, Lorenzo; Della Gatta, Giuseppe; Nowicka, Bozenna; Ferloni, Paolo,
Enthalpies and entropies of fusion of ten alkane-α, ω-diamines H2 N-- (CH 2)n-- NH2 where 3≤n≤12,
The Journal of Chemical Thermodynamics, 2002, 34, 1, 1-12, https://doi.org/10.1006/jcht.2001.0950
. [all data]
Gross, Rodriguez-Cruz, et al., 1995
Gross, D.S.; Rodriguez-Cruz, S.E.; Bock, S.; Williams, E.R.,
Measurement of the Coulomb Energy and Dielectric Polarizability of Gas-Phase Diprotonated Diaminoalkanes,
J. Phys. Chem., 1995, 99, 4034. [all data]
Hunter and Lias, 1998
Hunter, E.P.; Lias, S.G.,
Evaluated Gas Phase Basicities and Proton Affinities of Molecules: An Update,
J. Phys. Chem. Ref. Data, 1998, 27, 3, 413-656, https://doi.org/10.1063/1.556018
. [all data]
Peng, 2000
Peng, C.T.,
Prediction of retention indices. V. Influence of electronic effects and column polarity on retention index,
J. Chromatogr. A, 2000, 903, 1-2, 117-143, https://doi.org/10.1016/S0021-9673(00)00901-8
. [all data]