3-Pyridinemethanamine
- Formula: C6H8N2
- Molecular weight: 108.1411
- IUPAC Standard InChIKey: HDOUGSFASVGDCS-UHFFFAOYSA-N
- CAS Registry Number: 3731-52-0
- Chemical structure:
View 3d structure (requires JavaScript / HTML 5) - Other names: Picolamine; Pyridine, 3-(aminomethyl)-; 3-(Aminomethyl)pyridine; 3-Picolylamine; 3-Pyridinemethylamine; NSC 59706

Phase change data

Data compiled by: Robert L. Brown and Stephen E. Stein
Reduced pressure boiling point
Tboil (K) | Pressure (bar) | Reference |
---|---|---|
346.7 | 0.001 | Aldrich Chemical Company Inc., 1990 |
385. | 0.024 | Buckingham and Donaghy, 1982 |

Van Den Dool and Kratz RI, non-polar column, temperature ramp

Column type | Active phase | I | Reference | Comment |
---|---|---|---|---|
Capillary | OV-1 | 1066.4 | Gautzsch and Zinn, 1996 | 8. K/min; Tstart: 35. C; Tend: 300. C |
Capillary | DB-5 | 1117. | Premecz and Ford, 1987 | He, 60. C @ 10. min, 10. K/min, 280. C @ 3. min; Column length: 30. m; Column diameter: 0.32 mm |

Van Den Dool and Kratz RI, polar column, temperature ramp

Column type | Active phase | I | Reference | Comment |
---|---|---|---|---|
Capillary | CAM | 1849. | Premecz and Ford, 1987 | He, 60. C @ 5. min, 5. K/min, 240. C @ 21. min; Column length: 15. m; Column diameter: 0.24 mm |

References

Aldrich Chemical Company Inc., 1990
Aldrich Chemical Company Inc.,
Catalog Handbook of Fine Chemicals, Aldrich Chemical Company, Inc., Milwaukee WI, 1990, 1. [all data]
Buckingham and Donaghy, 1982
Buckingham, J.; Donaghy, S.M.,
Dictionary of Organic Compounds: Fifth Edition, Chapman and Hall, New York, 1982, 1. [all data]
Gautzsch and Zinn, 1996
Gautzsch, R.; Zinn, P.,
Use of incremental models to estimate the retention indexes of aromatic compounds,
Chromatographia, 1996, 43, 3/4, 163-176, https://doi.org/10.1007/BF02292946
. [all data]
Premecz and Ford, 1987
Premecz, J.E.; Ford, M.E.,
Gas chromatographic separation of substituted pyridines,
J. Chromatogr., 1987, 388, 23-35, https://doi.org/10.1016/S0021-9673(01)94463-2
. [all data]