2-Hexanol, 2,5-dimethyl-, (S)-
- Formula: C8H18O
- Molecular weight: 130.2279
- IUPAC Standard InChIKey: JPUIYNHIEXIFMV-UHFFFAOYSA-N
- CAS Registry Number: 3730-60-7
- Chemical structure:
View 3d structure (requires JavaScript / HTML 5) - Other names: 2-Hexanol, 2,5-dimethyl-, (S)-(+)-; 2,5-Dimethyl-2-hexanol; 2-Hexanol, 2,5-dimethyl-; 2,5-dimethylhexan-2-ol

Phase change data

Data compiled by: Thermodynamics Research Center, NIST Boulder Laboratories, Chris Muzny director
Quantity | Value | Units | Method | Reference | Comment |
---|---|---|---|---|---|
Tboil | 426.65 | K | N/A | Barclay and Hilchie, 1957 | Uncertainty assigned by TRC = 3. K |
Tboil | 421.15 | K | N/A | Woods and Viola, 1956 | Uncertainty assigned by TRC = 5. K |
Tboil | 427.15 | K | N/A | Dupont, 1913 | Uncertainty assigned by TRC = 3. K |
Tboil | 428.15 | K | N/A | Dupont, 1913 | Uncertainty assigned by TRC = 3. K |
Tboil | 426.15 | K | N/A | Clarke, 1909 | Uncertainty assigned by TRC = 3. K |

Van Den Dool and Kratz RI, non-polar column, temperature ramp

Column type | Active phase | I | Reference | Comment |
---|---|---|---|---|
Capillary | DB-5 | 857.1 | Xu, van Stee, et al., 2003 | 30. m/0.25 mm/1. μm, He, 2.5 K/min; Tstart: 50. C; Tend: 200. C |

References

Barclay and Hilchie, 1957
Barclay; Hilchie,
J. Org. Chem., 1957, 22, 633. [all data]
Woods and Viola, 1956
Woods, G.F.; Viola, A.,
J. Am. Chem. Soc., 1956, 78, 4380. [all data]
Dupont, 1913
Dupont, G.,
Ann. Chim. Phys., 1913, 30, 485. [all data]
Clarke, 1909
Clarke, L.,
Di-isobutyl or 2,5-dimethyl-hexane,
J. Am. Chem. Soc., 1909, 31, 585. [all data]