1-Ethyl-4-methylcyclohexane
- Formula: C9H18
- Molecular weight: 126.2392
- IUPAC Standard InChIKey: CYISMTMRBPPERU-UHFFFAOYSA-N
- CAS Registry Number: 3728-56-1
- Chemical structure:
View 3d structure (requires JavaScript / HTML 5) - Stereoisomers:

Phase change data

Data compiled by: Thermodynamics Research Center, NIST Boulder Laboratories, Chris Muzny director
Quantity | Value | Units | Method | Reference | Comment |
---|---|---|---|---|---|
Tboil | 423.7 | K | N/A | Signaigo and Cramer, 1933 | Uncertainty assigned by TRC = 2. K |
Tboil | 420. | K | N/A | Sabatier and Mailhe, 1906 | Uncertainty assigned by TRC = 3. K |
Tboil | 423. | K | N/A | Sabatier and Mailhe, 1906 | Uncertainty assigned by TRC = 4. K |

Normal alkane RI, non-polar column, temperature ramp

Column type | Active phase | I | Reference | Comment |
---|---|---|---|---|
Capillary | Polydimethyl siloxane: CP-Sil 5 CB | 888. | Bramston-Cook, 2013 | 60. m/0.25 mm/1.0 μm, Helium, 45. C @ 1.45 min, 3.6 K/min, 210. C @ 2.72 min |

Normal alkane RI, non-polar column, custom temperature program

Column type | Active phase | I | Reference | Comment |
---|---|---|---|---|
Capillary | DB-1 | 883. | Ciccioli, Cecinato, et al., 1994 | 60. m/0.32 mm/0.25 μm; Program: not specified |

References

Signaigo and Cramer, 1933
Signaigo, F.K.; Cramer, P.L.,
The preparation of some mono- and dialkylcylohexanes,
J. Am. Chem. Soc., 1933, 55, 3326-32. [all data]
Sabatier and Mailhe, 1906
Sabatier, P.; Mailhe, A.,
C. R. Hebd. Seances Acad. Sci., 1906, 142, 438. [all data]
Bramston-Cook, 2013
Bramston-Cook, R.,
Kovats indices for C2-C13 hydrocarbons and selected oxygenated/halocarbons with 100 % dimethylpolysiloxane columns, 2013, retrieved from http://lotusinstruments.com/monographs/List .... [all data]
Ciccioli, Cecinato, et al., 1994
Ciccioli, P.; Cecinato, A.; Brancaleoni, E.; Brachetti, A.; Frattoni, M.; Sparapani, R.,
Composition and Distribution of Polar and Non-Polar VOCs in Urban, Rural, Forest and Remote Areas,
Eur Commission EUR, 1994, 549-568. [all data]