Cyclohexane, 1-ethyl-2-methyl-
- Formula: C9H18
- Molecular weight: 126.2392
- IUPAC Standard InChIKey: XARGIVYWQPXRTC-UHFFFAOYSA-N
- CAS Registry Number: 3728-54-9
- Chemical structure:
View 3d structure (requires JavaScript / HTML 5) - Stereoisomers:
- Other names: 1-Ethyl-2-methylcyclohexane

Phase change data

Data compiled as indicated in comments:
BS - Robert L. Brown and Stephen E. Stein
TRC - Thermodynamics Research Center, NIST Boulder Laboratories, Chris Muzny director
Quantity | Value | Units | Method | Reference | Comment |
---|---|---|---|---|---|
Tboil | 424.2 | K | N/A | Weast and Grasselli, 1989 | BS |
Tboil | 426.8 | K | N/A | Signaigo and Cramer, 1933 | Uncertainty assigned by TRC = 3. K; TRC |

Normal alkane RI, non-polar column, custom temperature program

Column type | Active phase | I | Reference | Comment |
---|---|---|---|---|
Capillary | DB-5 MS | 919. | Cajka, Hajslova, et al., 2007 | 30. m/0.25 mm/0.25 μm, Helium; Program: 45 0C (0.75 min) 10 0C/min -> 200 0C 30 0C/min -> 245 0C (1.25 min) |

References

Weast and Grasselli, 1989
CRC Handbook of Data on Organic Compounds, 2nd Editon, Weast,R.C and Grasselli, J.G., ed(s)., CRC Press, Inc., Boca Raton, FL, 1989, 1. [all data]
Signaigo and Cramer, 1933
Signaigo, F.K.; Cramer, P.L.,
The preparation of some mono- and dialkylcylohexanes,
J. Am. Chem. Soc., 1933, 55, 3326-32. [all data]