Cyclopentane, 1-ethyl-3-methyl-
- Formula: C8H16
- Molecular weight: 112.2126
- IUPAC Standard InChIKey: PQXAPVOKLYINEI-UHFFFAOYSA-N
- CAS Registry Number: 3726-47-4
- Chemical structure:
View 3d structure (requires JavaScript / HTML 5) - Species with the same structure:
- Stereoisomers:
- Other names: 1-Methyl-3-ethylcyclopentane; 1-Ethyl-3-methylcyclopentane

Phase change data

Data compiled by: Thermodynamics Research Center, NIST Boulder Laboratories, Chris Muzny director
Quantity | Value | Units | Method | Reference | Comment |
---|---|---|---|---|---|
Tboil | 394.24 | K | N/A | Boord, Greenlee, et al., 1950 | Uncertainty assigned by TRC = 0.7 K |
Quantity | Value | Units | Method | Reference | Comment |
Tfus | 140.4 | K | N/A | Anonymous, 1950 | Uncertainty assigned by TRC = 1. K |
Tfus | 140.35 | K | N/A | Boord, Greenlee, et al., 1950 | Uncertainty assigned by TRC = 2. K |
Tfus | 140.5 | K | N/A | Anonymous, 1948 | Uncertainty assigned by TRC = 0.5 K |

Kovats' RI, non-polar column, isothermal

Column type | Active phase | Temperature (C) | I | Reference | Comment |
---|---|---|---|---|---|
Capillary | Squalane | 100. | 793.9 | Lulova, Leont'eva, et al., 1976 | He; Column length: 120. m; Column diameter: 0.25 mm |

Normal alkane RI, non-polar column, isothermal

Column type | Active phase | Temperature (C) | I | Reference | Comment |
---|---|---|---|---|---|
Capillary | OV-101 | 50. | 785. | Wu and Lu, 1984 | |
Capillary | OV-101 | 50. | 787. | Wu and Lu, 1984 | |
Capillary | OV-101 | 70. | 790. | Wu and Lu, 1984 | |
Capillary | OV-101 | 70. | 792. | Wu and Lu, 1984 |

Normal alkane RI, non-polar column, temperature ramp

Column type | Active phase | I | Reference | Comment |
---|---|---|---|---|
Capillary | SE-54 | 787. | Guan, Li, et al., 1995 | 60. C @ 2. min, 4. K/min; Column length: 50. m; Column diameter: 0.32 mm; Tend: 200. C |

Normal alkane RI, non-polar column, custom temperature program

Column type | Active phase | I | Reference | Comment |
---|---|---|---|---|
Capillary | Squalane | 788. | Chen, 2008 | Program: not specified |
Capillary | Squalane | 808. | Chen, 2008 | Program: not specified |

References

Boord, Greenlee, et al., 1950
Boord, C.E.; Greenlee, K.W.; Derfer, J.M.,
The Synthesis, Purification and Prop. of Hydrocarbons of Low Mol. Wt., Am. Pet. Inst. Res. Proj. 45, Twelfth Annu. Rep., Ohio State Univ., 1950. [all data]
Anonymous, 1950
Anonymous, R.,
, Am. Pet. Inst. Res. Proj. 6, Natl. Bur. Stand., 1950. [all data]
Anonymous, 1948
Anonymous, R.,
, Am. Pet. Inst. Res. Proj. 6, Natl. Bur. Stand., 1948. [all data]
Lulova, Leont'eva, et al., 1976
Lulova, N.I.; Leont'eva, S.A.; Timofeeva, A.N.,
Gas-chromatographic method of determination of individual hydrocarbons in catalytic cracking gasolines
in Proceedings of All-Union Research Institute on Oil Processes. Vol.18, All-Union Research Institute on Oil Processes, Moscow, 1976, 30-53. [all data]
Wu and Lu, 1984
Wu, J.; Lu, W.,
Kovats indices of C4-C10 hydrocarbons in apolar quartz capillary OV-101,
Chin. J. Chromatogr., 1984, 1, 1, 11-17. [all data]
Guan, Li, et al., 1995
Guan, Y.; Li, L.; Zhou, L.,
Live retention database for compound identification in capillary gas chromatography,
Chin. J. Chromatogr., 1995, 13, 5, 851-857. [all data]
Chen, 2008
Chen, H.-F.,
Quantitative prediction of gas chromatography retention indices with support vector machines, radial basis neutral networks and multiple linear regression,
Anal. Chim. Acta, 2008, 609, 1, 24-36, https://doi.org/10.1016/j.aca.2008.01.003
. [all data]