Cyclopentane, 1-ethyl-2-methyl-
- Formula: C8H16
- Molecular weight: 112.2126
- IUPAC Standard InChIKey: BSKOLJVTLRLTHE-UHFFFAOYSA-N
- CAS Registry Number: 3726-46-3
- Chemical structure:
View 3d structure (requires JavaScript / HTML 5) - Species with the same structure:
- Stereoisomers:

Normal alkane RI, non-polar column, isothermal

Column type | Active phase | Temperature (C) | I | Reference | Comment |
---|---|---|---|---|---|
Capillary | Methyl Silicone | 50. | 821. | N/A | N2; Column length: 74.6 m; Column diameter: 0.28 mm |
Capillary | OV-101 | 50. | 789. | Wu and Lu, 1984 | |
Capillary | OV-101 | 70. | 793. | Wu and Lu, 1984 |

Normal alkane RI, non-polar column, temperature ramp

Column type | Active phase | I | Reference | Comment |
---|---|---|---|---|
Capillary | SE-54 | 790. | Guan, Li, et al., 1995 | 60. C @ 2. min, 4. K/min; Column length: 50. m; Column diameter: 0.32 mm; Tend: 200. C |

Normal alkane RI, non-polar column, custom temperature program

Column type | Active phase | I | Reference | Comment |
---|---|---|---|---|
Capillary | Squalane | 788. | Chen, 2008 | Program: not specified |
Capillary | Squalane | 811. | Chen, 2008 | Program: not specified |
Capillary | SE-52 | 792. | van Langenhove and Schamp, 1986 | Column length: 100. m; Column diameter: 0.50 mm; Program: not specified |
Capillary | SE-52 | 794. | van Langenhove and Schamp, 1986 | Column length: 100. m; Column diameter: 0.50 mm; Program: not specified |

References

Wu and Lu, 1984
Wu, J.; Lu, W.,
Kovats indices of C4-C10 hydrocarbons in apolar quartz capillary OV-101,
Chin. J. Chromatogr., 1984, 1, 1, 11-17. [all data]
Guan, Li, et al., 1995
Guan, Y.; Li, L.; Zhou, L.,
Live retention database for compound identification in capillary gas chromatography,
Chin. J. Chromatogr., 1995, 13, 5, 851-857. [all data]
Chen, 2008
Chen, H.-F.,
Quantitative prediction of gas chromatography retention indices with support vector machines, radial basis neutral networks and multiple linear regression,
Anal. Chim. Acta, 2008, 609, 1, 24-36, https://doi.org/10.1016/j.aca.2008.01.003
. [all data]
van Langenhove and Schamp, 1986
van Langenhove, H.; Schamp, N.,
Identification of Volatiles in the Head Space of Acid-Treated Phosphate Rock by Gas Chromatography-Mass Spectromety,
J. Chromatogr., 1986, 351, 65-75, https://doi.org/10.1016/S0021-9673(01)83473-7
. [all data]