1,5-Hexadien-3-yne, 2,5-dimethyl-
- Formula: C8H10
- Molecular weight: 106.1650
- IUPAC Standard InChIKey: QZXJPGFNLZJNAR-UHFFFAOYSA-N
- CAS Registry Number: 3725-05-1
- Chemical structure:
View 3d structure (requires JavaScript / HTML 5) - Other names: Hexa-1,5-diene-3-yne, 2,5-dimethyl-

Normal alkane RI, non-polar column, custom temperature program

Column type | Active phase | I | Reference | Comment |
---|---|---|---|---|
Capillary | Methyl Silicone | 800. | Zenkevich, 1998 | Program: not specified |

Gas phase ion energetics data

Data compiled as indicated in comments:
RDSH - Henry M. Rosenstock, Keith Draxl, Bruce W. Steiner, and John T. Herron
Ionization energy determinations
IE (eV) | Method | Reference | Comment |
---|---|---|---|
9.0 ± 0.1 | EI | Meyer, Haynes, et al., 1965 | RDSH |
Appearance energy determinations
Ion | AE (eV) | Other Products | Method | Reference | Comment |
---|---|---|---|---|---|
C7H7+ | 10.5 ± 0.1 | CH3 | EI | Meyer, Haynes, et al., 1965 | RDSH |
C8H9+ | 10.4 ± 0.1 | H | EI | Meyer, Haynes, et al., 1965 | RDSH |

References

Zenkevich, 1998
Zenkevich, I.G.,
Non-Traditional Criteria for Gas-Chromatographic and Chromato-Mass-Spectrometric Identification of Organic Compounds,
Zh. Anal. Khim., 1998, 53, 8, 828-835. [all data]